{"text_format":"1","workbook":"xlsx","n_sheets":13,"sheets":["Settings","Intro","Assumptions","Unit Mix","Lease Up Schedule","Cash Flows","Summary Charts","Summary & Ratios","Return Detail","Loan Amortization","Sources & Uses","Equity Investor Returns","Holding Period Sensitivity"],"not_rendered":{"charts":10,"images":4,"macros":1,"external_links":0,"defined_names":130,"comments":0,"pivot_tables":0},"unopened":[],"bounds":{"document_bytes":16777216,"sheet_cells":100000,"rows_first":2000,"rows_last":500,"rows_between":2000,"halvings":0,"cell_chars":16384,"cell_head_chars":4096},"cells_cut":0,"cells_raw":0,"read":"whole","date_system":"1900"}

{"sheet":"Settings","index":0,"n_rows":79,"n_cols":30,"rows_kept":79,"cut":false,"hidden":true,"merged":[]}
["Version Number","Lock Workbooks:","BETA"]
[9.42,"Yes","No"]
[{"$f":"CONCATENATE(A2,\" SH | © 2022\")","v":"9.42 SH | © 2022"}]
[]
["View Options",1,1]
["Input View",null,"Show Periods"]
["Print View",null,"Show Dates"]
[]
["Summary Chart Data",null,1,2,3,4,5,6,7,8,9,10,null,"Amortizing Rate Structure",null,null,null,"Loan Costs Amortization"]
["Net Operating Income",null,{"$f":"'Sources & Uses'!D11","v":515106.375},{"$f":"'Sources & Uses'!E11","v":822908.71499999985},{"$f":"'Sources & Uses'!F11","v":847595.97644999996},{"$f":"'Sources & Uses'!G11","v":873023.85574349994},{"$f":"'Sources & Uses'!H11","v":899214.57141580491},{"$f":"'Sources & Uses'!I11","v":926191.00855827914},{"$f":"'Sources & Uses'!J11","v":953976.73881502752},{"$f":"'Sources & Uses'!K11","v":982596.04097947839},{"$f":"'Sources & Uses'!L11","v":1012073.9222088627},{"$f":"'Sources & Uses'!M11","v":1042436.1398751285},null,"Year","Step ","Rate",null,"Year","Start","End","I/O","Amortizing","Total"]
{"$rows_left_out":70}
{"sheet":"Intro","index":1,"n_rows":0,"n_cols":0,"rows_kept":0,"cut":false,"hidden":false,"merged":[[31,2,31,8]]}

{"sheet":"Assumptions","index":2,"n_rows":57,"n_cols":8,"rows_kept":57,"cut":false,"hidden":false,"merged":[[54,5,54,7],[55,5,55,7],[56,5,56,7],[1,1,1,7],[36,1,36,3],[3,1,3,7],[36,5,36,7],[50,1,50,3],[30,1,30,3]]}
[]
[null,{"$f":"$D$7","v":"New Student Housing Project"}]
[]
[null,"Project Assumptions"]
[]
[null,"Property Information",null,null,null,"Acquisition Assumptions"]
[null,"Property Name",null,"New Student Housing Project",null,"Project Type",null,"Acquisition"]
[null,"Location",null,null,null,{"$f":"IF(Project_Type=\"Acquisition\",\"Acquisition Cost\",\"Land Cost\")","v":"Acquisition Cost"},null,0]
[null,"Property Use",null,"Student Housing",null,{"$f":"IF(Project_Type=\"Acquisition\",\"Other Costs\",\"Hard Costs\")","v":"Other Costs"},null,0]
[null,"Total Beds",null,{"$f":"Unit_Mix[[#Totals],[Total Beds]]","v":100},null,{"$f":"IF(Project_Type=\"Acquisition\",\"-\",\"Soft Costs\")","v":"-"},null,0]
{"$rows_left_out":48}
{"sheet":"Unit Mix","index":3,"n_rows":18,"n_cols":12,"rows_kept":18,"cut":false,"hidden":false,"merged":[[2,1,2,11],[4,1,4,11],[15,1,15,11],[16,1,16,11],[17,1,17,11]]}
[]
[]
[null,{"$f":"Project_Name","v":"New Student Housing Project"}]
[]
[null,"Unit Mix"]
[]
[]
[null,"Unit Type","Units","Beds ","Baths","Total Beds","%","Unit SF","Total SF","Monthly Rental Rate","$ PSF","Total Monthly Rent"]
[null,"Eff",10,1,1,{"$f":"Unit_Mix[[#This Row],[Units]]*Unit_Mix[[#This Row],[Beds ]]","v":10},{"$f":"Unit_Mix[[#This Row],[Total Beds]]/SUM(Unit_Mix[Total Beds])","v":0.1},650,{"$f":"Unit_Mix[[#This Row],[Unit SF]]*Unit_Mix[[#This Row],[Units]]","v":6500},850,{"$f":"Unit_Mix[[#This Row],[Total Monthly Rent]]/Unit_Mix[[#This Row],[Total SF]]","v":1.3076923076923077},{"$f":"Unit_Mix[[#This Row],[Monthly Rental Rate]]*Unit_Mix[[#This Row],[Total Beds]]","v":8500}]
[null,"A",15,2,1,{"$f":"Unit_Mix[[#This Row],[Units]]*Unit_Mix[[#This Row],[Beds ]]","v":30},{"$f":"Unit_Mix[[#This Row],[Total Beds]]/SUM(Unit_Mix[Total Beds])","v":0.3},900,{"$f":"Unit_Mix[[#This Row],[Unit SF]]*Unit_Mix[[#This Row],[Units]]","v":13500},775,{"$f":"Unit_Mix[[#This Row],[Total Monthly Rent]]/Unit_Mix[[#This Row],[Total SF]]","v":1.7222222222222223},{"$f":"Unit_Mix[[#This Row],[Monthly Rental Rate]]*Unit_Mix[[#This Row],[Total Beds]]","v":23250}]
{"$rows_left_out":9}
{"sheet":"Lease Up Schedule","index":4,"n_rows":157,"n_cols":8,"rows_kept":157,"cut":false,"hidden":false,"merged":[[34,6,34,7],[2,1,2,7],[12,1,12,7],[13,1,13,7],[15,1,15,7],[32,6,32,7],[33,6,33,7]]}
[]
[]
[null,"Lease-Up Schedule"]
[]
[null,"Total Units",null,{"$f":"SF_Total","v":100}]
[null,"Beginning Occupancy",null,0]
[null,"Stabilized Occupancy",null,0.95]
[null,"Stabilized Units",null,{"$f":"ROUND(D5*D7,0)","v":95}]
[null,"Begin Occupying in Month",null,1]
[null,"Units Pre-Leased",null,0]
{"$rows_left_out":148}
{"sheet":"Cash Flows","index":5,"n_rows":168,"n_cols":16,"rows_kept":168,"cut":false,"hidden":false,"merged":[[165,1,165,15],[166,1,166,15],[167,1,167,15],[74,1,74,15],[75,1,75,15],[76,1,76,15]]}
[]
[]
[]
[]
[null,"Schedule of Prospective Cash Flows"]
[]
[null,"Period",null,null,null,1,2,3,4,5,6,7,8,9,10,11]
[null,null,null,null,null,{"$f":"RPMDateSpan(F7,1)","v":"Jan 22 - Dec 22"},{"$f":"RPMDateSpan(G7,1)","v":"Jan 23 - Dec 23"},"Jan 24 - Dec 24","Jan 25 - Dec 25","Jan 26 - Dec 26","Jan 27 - Dec 27","Jan 28 - Dec 28","Jan 29 - Dec 29","Jan 30 - Dec 30","Jan 31 - Dec 31","Jan 32 - Dec 32"]
[]
[null,"Operating Income",null,null,"Inflation",null,{"$f":"Inflation","v":0.03},{"$f":"G10","v":0.03},{"$f":"H10","v":0.03},{"$f":"I10","v":0.03},0.03,0.03,0.03,0.03,0.03,0.03]
{"$rows_left_out":159}
{"sheet":"Summary Charts","index":6,"n_rows":73,"n_cols":25,"rows_kept":73,"cut":false,"hidden":false,"merged":[[72,1,72,12],[2,1,2,12],[4,1,4,12],[69,1,69,12],[70,1,70,12],[71,1,71,12]]}
[]
[]
[null,{"$f":"Project_Name","v":"New Student Housing Project"}]
[]
[null,"Project Return Summary"]
[null,null,null,null,null,null,null,null,null,null,null,null,null,null,"Period",1,2,3,4,5,6,7,8,9,10]
[null,"Summary",null,null,"Sale Analysis",null,null,"Cash Flows",null,null,null,"IRR & Present Value",null,null,"Summary Chart Data",{"$f":"IF(DateView=1,P6,RPMDateSpan(P6,2))","v":1},2,3,4,5,6,7,8,9,10]
[null,"Total Units/Bed",{"$f":"Unit_Mix[[#Totals],[Units]]&\"/\"&SF_Total","v":"40/100"},null,{"$f":"IF(Project_Type=\"Acquisition\",\"Acquisition Price\",\"Development Cost\")","v":"Acquisition Price"},{"$f":"Acquisition_Gross","v":0},null,null,"Before Tax","After Tax",null,"Unleveraged IRR",{"$f":"'Return Detail'!$C$17","v":"-"},null,"Net Operating Income",{"$f":"'Summary & Ratios'!D$10","v":515106.375},{"$f":"'Summary & Ratios'!E$10","v":822908.71499999985},{"$f":"'Summary & Ratios'!F$10","v":847595.97644999996},{"$f":"'Summary & Ratios'!G$10","v":873023.85574349994},{"$f":"'Summary & Ratios'!H$10","v":899214.57141580491},{"$f":"'Summary & Ratios'!I$10","v":926191.00855827914},{"$f":"'Summary & Ratios'!J$10","v":953976.73881502752},{"$f":"'Summary & Ratios'!K$10","v":982596.04097947839},{"$f":"'Summary & Ratios'!L$10","v":1012073.9222088627},{"$f":"'Summary & Ratios'!M$10","v":1042436.1398751285}]
[null,{"$f":"IF(Project_Type=\"Acquisition\",\"Acquisition Price\",\"Development Costs\")","v":"Acquisition Price"},{"$f":"Acquisition_Gross","v":0},null,"Per Bed",{"$f":"IFERROR(Acquisition_Gross/Size_Total,0)","v":0},null,"Operating Cash Flows",{"$f":"SUM('Return Detail'!$F$32:$O$32)","v":8875123.3440460805},{"$f":"SUM('Return Detail'!F83:O83)","v":5768830.1736299526},null,{"$f":"\"Unleveraged PV at \" &(Equity_Rate*100)&\"%\"","v":"Unleveraged PV at 10%"},{"$f":"'Return Detail'!$C$20","v":9380000},null,"Debt Serivce",{"$f":"IF(-'Summary & Ratios'!D$11=0,NA(),-'Summary & Ratios'!D$11)","v":{"$error":"#N/A"}},{"$f":"IF(-'Summary & Ratios'!E$11=0,NA(),-'Summary & Ratios'!E$11)","v":{"$error":"#N/A"}},{"$f":"IF(-'Summary & Ratios'!F$11=0,NA(),-'Summary & Ratios'!F$11)","v":{"$error":"#N/A"}},{"$f":"IF(-'Summary & Ratios'!G$11=0,NA(),-'Summary & Ratios'!G$11)","v":{"$error":"#N/A"}},{"$f":"IF(-'Summary & Ratios'!H$11=0,NA(),-'Summary & Ratios'!H$11)","v":{"$error":"#N/A"}},{"$f":"IF(-'Summary & Ratios'!I$11=0,NA(),-'Summary & Ratios'!I$11)","v":{"$error":"#N/A"}},{"$f":"IF(-'Summary & Ratios'!J$11=0,NA(),-'Summary & Ratios'!J$11)","v":{"$error":"#N/A"}},{"$f":"IF(-'Summary & Ratios'!K$11=0,NA(),-'Summary & Ratios'!K$11)","v":{"$error":"#N/A"}},{"$f":"IF(-'Summary & Ratios'!L$11=0,NA(),-'Summary & Ratios'!L$11)","v":{"$error":"#N/A"}},{"$f":"IF(-'Summary & Ratios'!M$11=0,NA(),-'Summary & Ratios'!M$11)","v":{"$error":"#N/A"}}]
[null,"Other Costs",{"$f":"'Sources & Uses'!C19","v":0},null,"Sale Price",{"$f":"SUM('Return Detail'!F10:O10)","v":10737092.240713825},null,"Net Sale Proceeds",{"$f":"SUM('Return Detail'!$F$33:$O$36)","v":10737092.240713825},{"$f":"SUM('Return Detail'!F84:O84)","v":8589673.7925710604},null,"Leveraged IRR",{"$f":"'Return Detail'!C42","v":"-"},null,"Cash Flow After Taxes",{"$f":"'Return Detail'!F$83","v":334819.14375000005},{"$f":"'Return Detail'!G$83","v":534890.66475},{"$f":"'Return Detail'!H$83","v":550937.3846925},{"$f":"'Return Detail'!I$83","v":567465.50623327494},{"$f":"'Return Detail'!J$83","v":584489.47142027318},{"$f":"'Return Detail'!K$83","v":602024.15556288138},{"$f":"'Return Detail'!L$83","v":620084.88022976788},{"$f":"'Return Detail'!M$83","v":638687.42663666094},{"$f":"'Return Detail'!N$83","v":657848.04943576083},{"$f":"'Return Detail'!O$83","v":677583.49091883353}]
{"$rows_left_out":64}
{"sheet":"Summary & Ratios","index":7,"n_rows":59,"n_cols":14,"rows_kept":59,"cut":false,"hidden":false,"merged":[[58,1,58,12]]}
[]
[null,"Summary & Ratios"]
[]
[null,null,null,1,2,3,4,5,6,7,8,9,10,"Total"]
[null,null,null,{"$f":"RPMDateSpan(D4,1)","v":"Jan 22 - Dec 22"},{"$f":"RPMDateSpan(E4,1)","v":"Jan 23 - Dec 23"},"Jan 24 - Dec 24","Jan 25 - Dec 25","Jan 26 - Dec 26","Jan 27 - Dec 27","Jan 28 - Dec 28","Jan 29 - Dec 29","Jan 30 - Dec 30","Jan 31 - Dec 31"]
[null,"Operating Summary"]
[null,"Effective Gross Income",null,{"$f":"'Cash Flows'!F35","v":531037.5},{"$f":"'Cash Flows'!G35","v":848359.49999999988},{"$f":"'Cash Flows'!H35","v":873810.28499999992},{"$f":"'Cash Flows'!I35","v":900024.59354999999},{"$f":"'Cash Flows'!J35","v":927025.33135649993},{"$f":"'Cash Flows'!K35","v":954836.09129719494},{"$f":"'Cash Flows'!L35","v":983481.17403611087},{"$f":"'Cash Flows'!M35","v":1012985.6092571942},{"$f":"'Cash Flows'!N35","v":1043375.17753491},{"$f":"'Cash Flows'!O35","v":1074676.4328609572},{"$f":"SUM(D7:M7)","v":9149611.6948928665}]
[null,"Operating Expenses",null,{"$f":"-'Cash Flows'!F55","v":-15931.125},{"$f":"-'Cash Flows'!G55","v":-25450.784999999996},{"$f":"-'Cash Flows'!H55","v":-26214.308549999998},{"$f":"-'Cash Flows'!I55","v":-27000.737806499998},{"$f":"-'Cash Flows'!J55","v":-27810.759940694996},{"$f":"-'Cash Flows'!K55","v":-28645.082738915848},{"$f":"-'Cash Flows'!L55","v":-29504.435221083324},{"$f":"-'Cash Flows'!M55","v":-30389.568277715825},{"$f":"-'Cash Flows'!N55","v":-31301.2553260473},{"$f":"-'Cash Flows'!O55","v":-32240.292985828717},{"$f":"SUM(D8:M8)","v":-274488.35084678599}]
[null,"Operating  Reserves",null,{"$f":"-'Cash Flows'!F$65","v":0},{"$f":"-'Cash Flows'!G$65","v":0},{"$f":"-'Cash Flows'!H$65","v":0},{"$f":"-'Cash Flows'!I$65","v":0},{"$f":"-'Cash Flows'!J$65","v":0},{"$f":"-'Cash Flows'!K$65","v":0},{"$f":"-'Cash Flows'!L$65","v":0},{"$f":"-'Cash Flows'!M$65","v":0},{"$f":"-'Cash Flows'!N$65","v":0},{"$f":"-'Cash Flows'!O$65","v":0},0]
[null,"Net Operating Income",null,{"$f":"'Cash Flows'!F67","v":515106.375},{"$f":"'Cash Flows'!G67","v":822908.71499999985},{"$f":"'Cash Flows'!H67","v":847595.97644999996},{"$f":"'Cash Flows'!I67","v":873023.85574349994},{"$f":"'Cash Flows'!J67","v":899214.57141580491},{"$f":"'Cash Flows'!K67","v":926191.00855827914},{"$f":"'Cash Flows'!L67","v":953976.73881502752},{"$f":"'Cash Flows'!M67","v":982596.04097947839},{"$f":"'Cash Flows'!N67","v":1012073.9222088627},{"$f":"'Cash Flows'!O67","v":1042436.1398751285},8875123.3440460805]
{"$rows_left_out":50}
{"sheet":"Return Detail","index":8,"n_rows":105,"n_cols":15,"rows_kept":105,"cut":false,"hidden":false,"merged":[[1,1,1,14],[104,1,104,14]]}
[]
[null,"Project Return Details"]
[]
[null,"Unlevered Returns"]
[null,null,null,null,null,1,2,3,4,5,6,7,8,9,10]
[null,"Net Operating Income",null,null,null,{"$f":"IF($F$5<=Hold,'Cash Flows'!F$67,0)","v":515106.375},{"$f":"IF(G5<=Hold,'Cash Flows'!G$67,0)","v":822908.71499999985},{"$f":"IF(H5<=Hold,'Cash Flows'!H$67,0)","v":847595.97644999996},{"$f":"IF(I5<=Hold,'Cash Flows'!I$67,0)","v":873023.85574349994},{"$f":"IF(J5<=Hold,'Cash Flows'!J$67,0)","v":899214.57141580491},{"$f":"IF(K5<=Hold,'Cash Flows'!K$67,0)","v":926191.00855827914},{"$f":"IF(L5<=Hold,'Cash Flows'!L$67,0)","v":953976.73881502752},{"$f":"IF(M5<=Hold,'Cash Flows'!M$67,0)","v":982596.04097947839},{"$f":"IF(N5<=Hold,'Cash Flows'!N$67,0)","v":1012073.9222088627},{"$f":"IF(O5<=Hold,'Cash Flows'!O$67,0)","v":1042436.1398751285}]
[null,"Less: Capital Expenses",null,null,null,{"$f":"IF(F$5<=Hold,'Cash Flows'!F112*-1,0)","v":0},{"$f":"IF(G$5<=Hold,'Cash Flows'!G112*-1,0)","v":0},{"$f":"IF(H$5<=Hold,'Cash Flows'!H112*-1,0)","v":0},{"$f":"IF(I$5<=Hold,'Cash Flows'!I112*-1,0)","v":0},{"$f":"IF(J$5<=Hold,'Cash Flows'!J112*-1,0)","v":0},{"$f":"IF(K$5<=Hold,'Cash Flows'!K112*-1,0)","v":0},{"$f":"IF(L$5<=Hold,'Cash Flows'!L112*-1,0)","v":0},{"$f":"IF(M$5<=Hold,'Cash Flows'!M112*-1,0)","v":0},{"$f":"IF(N$5<=Hold,'Cash Flows'!N112*-1,0)","v":0},{"$f":"IF(O$5<=Hold,'Cash Flows'!O112*-1,0)","v":0}]
[null,"Non-Regular Income",null,null,null,{"$f":"IF(F5>Hold,0,'Cash Flows'!F$119)","v":0},{"$f":"IF(G5>Hold,0,'Cash Flows'!G$119)","v":0},{"$f":"IF(H5>Hold,0,'Cash Flows'!H$119)","v":0},{"$f":"IF(I5>Hold,0,'Cash Flows'!I$119)","v":0},{"$f":"IF(J5>Hold,0,'Cash Flows'!J$119)","v":0},{"$f":"IF(K5>Hold,0,'Cash Flows'!K$119)","v":0},{"$f":"IF(L5>Hold,0,'Cash Flows'!L$119)","v":0},{"$f":"IF(M5>Hold,0,'Cash Flows'!M$119)","v":0},{"$f":"IF(N5>Hold,0,'Cash Flows'!N$119)","v":0},{"$f":"IF(O5>Hold,0,'Cash Flows'!O$119)","v":0}]
[null,"Operating Cash Flow",null,null,null,{"$f":"SUM(F6:F8)","v":515106.375},{"$f":"SUM(G6:G8)","v":822908.71499999985},847595.97644999996,873023.85574349994,899214.57141580491,926191.00855827914,953976.73881502752,982596.04097947839,1012073.9222088627,1042436.1398751285]
[null,"Reversion Cash Flow",null,null,null,{"$f":"IFERROR(IF(F$5=Hold,IF(Disposition=\"Cap Rate\",'Cash Flows'!G$59/Exit_Rate,FV(Exit_Rate,Hold,0,-Acquisition_Gross)),0),0)","v":0},{"$f":"IFERROR(IF(G$5=Hold,IF(Disposition=\"Cap Rate\",'Cash Flows'!H$59/Exit_Rate,FV(Exit_Rate,Hold,0,-Acquisition_Gross)),0),0)","v":0},{"$f":"IFERROR(IF(H$5=Hold,IF(Disposition=\"Cap Rate\",'Cash Flows'!I$59/Exit_Rate,FV(Exit_Rate,Hold,0,-Acquisition_Gross)),0),0)","v":0},{"$f":"IFERROR(IF(I$5=Hold,IF(Disposition=\"Cap Rate\",'Cash Flows'!J$59/Exit_Rate,FV(Exit_Rate,Hold,0,-Acquisition_Gross)),0),0)","v":0},{"$f":"IFERROR(IF(J$5=Hold,IF(Disposition=\"Cap Rate\",'Cash Flows'!K$59/Exit_Rate,FV(Exit_Rate,Hold,0,-Acquisition_Gross)),0),0)","v":0},{"$f":"IFERROR(IF(K$5=Hold,IF(Disposition=\"Cap Rate\",'Cash Flows'!L$59/Exit_Rate,FV(Exit_Rate,Hold,0,-Acquisition_Gross)),0),0)","v":0},{"$f":"IFERROR(IF(L$5=Hold,IF(Disposition=\"Cap Rate\",'Cash Flows'!M$59/Exit_Rate,FV(Exit_Rate,Hold,0,-Acquisition_Gross)),0),0)","v":0},{"$f":"IFERROR(IF(M$5=Hold,IF(Disposition=\"Cap Rate\",'Cash Flows'!N$59/Exit_Rate,FV(Exit_Rate,Hold,0,-Acquisition_Gross)),0),0)","v":0},{"$f":"IFERROR(IF(N$5=Hold,IF(Disposition=\"Cap Rate\",'Cash Flows'!O$59/Exit_Rate,FV(Exit_Rate,Hold,0,-Acquisition_Gross)),0),0)","v":0},{"$f":"IFERROR(IF(O$5=Hold,IF(Disposition=\"Cap Rate\",'Cash Flows'!P$59/Exit_Rate,FV(Exit_Rate,Hold,0,-Acquisition_Gross)),0),0)","v":10737092.240713825}]
{"$rows_left_out":96}
{"sheet":"Loan Amortization","index":9,"n_rows":170,"n_cols":15,"rows_kept":170,"cut":false,"hidden":false,"merged":[[45,8,45,9],[2,1,2,9],[4,7,4,8],[43,8,43,9],[44,8,44,9],[4,2,4,3]]}
[]
[]
[null,"Loan Amortization Schedule"]
[]
[null,null,"Interest Only Loan",null,null,null,null,"Amortizing Loan"]
[null,null,"Loan Amount",{"$f":"IF(Loan_IO_Approval=\"no\",\"-\",Loan_Amount)","v":"-"},null,null,null,"Loan Amount",{"$f":"Loan_Amount_Amortizing","v":0}]
[null,null,"Term",{"$f":"IF(Loan_IO_Approval=\"no\",\"-\",Loan_IO_Term)","v":"-"},null,null,null,"Term",{"$f":"Loan_Amor_Term","v":0}]
[null,null,"Rate",{"$f":"IF(Loan_IO_Approval=\"no\",\"-\",Loan_IO_Rate)","v":"-"},null,null,null,"Amortization",{"$f":"Loan_Amortization","v":0}]
[null,null,"Funding Status",{"$f":"IF(Loan_IO_Approval=\"no\",\"-\",IF(Loan_IO_Status=0,\"Fund Up (Default)\",Loan_IO_Status))","v":"-"},null,null,null,"Rate",{"$f":"Loan_Amor_Rate","v":0}]
[null,null,null,null,null,null,null,"Rate Type",{"$f":"Loan_Amor_Type","v":"Fixed"}]
{"$rows_left_out":161}
{"sheet":"Sources & Uses","index":10,"n_rows":39,"n_cols":14,"rows_kept":39,"cut":false,"hidden":false,"merged":[[36,1,36,13],[37,1,37,13],[38,1,38,13]]}
[]
[null,"Sources & Uses"]
[]
[null,"Period",0,1,2,3,4,5,6,7,8,9,10,"Total"]
[null,null,null,{"$f":"RPMDateSpan(D4,1)","v":"Jan 22 - Dec 22"},{"$f":"RPMDateSpan(E4,1)","v":"Jan 23 - Dec 23"},"Jan 24 - Dec 24","Jan 25 - Dec 25","Jan 26 - Dec 26","Jan 27 - Dec 27","Jan 28 - Dec 28","Jan 29 - Dec 29","Jan 30 - Dec 30","Jan 31 - Dec 31"]
[]
[null,"Sources Of Capital"]
[null,"Debt Proceeds",{"$f":"IF(AND(Loan_IO_Status=\"Fund Up\",Loan_IO_Term>0,Loan_IO_Approval=\"Yes\"),0,Loan_Amount)","v":0},{"$f":"IF(OR(Loan_IO_Status<>\"Fund Up\",Loan_IO_Approval=\"No\"),0,IF(D4*12<=Loan_IO_MonthFunded,VLOOKUP(D4,Amortization_Schedule_Annual,9,FALSE)-SUM($C$8:C8),IF(AND(Loan_IO_MonthFunded>C4*12,Loan_IO_MonthFunded<=D4*12),Loan_Amount-SUM($C$8:C8),0)))","v":0},{"$f":"IF(OR(Loan_IO_Status<>\"Fund Up\",Loan_IO_Approval=\"No\"),0,IF(E4*12<=Loan_IO_MonthFunded,VLOOKUP(E4,Amortization_Schedule_Annual,9,FALSE)-SUM($C$8:D8),IF(AND(Loan_IO_MonthFunded>D4*12,Loan_IO_MonthFunded<=E4*12),Loan_Amount-SUM($C$8:D8),0)))","v":0},{"$f":"IF(OR(Loan_IO_Status<>\"Fund Up\",Loan_IO_Approval=\"No\"),0,IF(F4*12<=Loan_IO_MonthFunded,VLOOKUP(F4,Amortization_Schedule_Annual,9,FALSE)-SUM($C$8:E8),IF(AND(Loan_IO_MonthFunded>E4*12,Loan_IO_MonthFunded<=F4*12),Loan_Amount-SUM($C$8:E8),0)))","v":0},{"$f":"IF(OR(Loan_IO_Status<>\"Fund Up\",Loan_IO_Approval=\"No\"),0,IF(G4*12<=Loan_IO_MonthFunded,VLOOKUP(G4,Amortization_Schedule_Annual,9,FALSE)-SUM($C$8:F8),IF(AND(Loan_IO_MonthFunded>F4*12,Loan_IO_MonthFunded<=G4*12),Loan_Amount-SUM($C$8:F8),0)))","v":0},{"$f":"IF(OR(Loan_IO_Status<>\"Fund Up\",Loan_IO_Approval=\"No\"),0,IF(H4*12<=Loan_IO_MonthFunded,VLOOKUP(H4,Amortization_Schedule_Annual,9,FALSE)-SUM($C$8:G8),IF(AND(Loan_IO_MonthFunded>G4*12,Loan_IO_MonthFunded<=H4*12),Loan_Amount-SUM($C$8:G8),0)))","v":0},{"$f":"IF(OR(Loan_IO_Status<>\"Fund Up\",Loan_IO_Approval=\"No\"),0,IF(I4*12<=Loan_IO_MonthFunded,VLOOKUP(I4,Amortization_Schedule_Annual,9,FALSE)-SUM($C$8:H8),IF(AND(Loan_IO_MonthFunded>H4*12,Loan_IO_MonthFunded<=I4*12),Loan_Amount-SUM($C$8:H8),0)))","v":0},{"$f":"IF(OR(Loan_IO_Status<>\"Fund Up\",Loan_IO_Approval=\"No\"),0,IF(J4*12<=Loan_IO_MonthFunded,VLOOKUP(J4,Amortization_Schedule_Annual,9,FALSE)-SUM($C$8:I8),IF(AND(Loan_IO_MonthFunded>I4*12,Loan_IO_MonthFunded<=J4*12),Loan_Amount-SUM($C$8:I8),0)))","v":0},{"$f":"IF(OR(Loan_IO_Status<>\"Fund Up\",Loan_IO_Approval=\"No\"),0,IF(K4*12<=Loan_IO_MonthFunded,VLOOKUP(K4,Amortization_Schedule_Annual,9,FALSE)-SUM($C$8:J8),IF(AND(Loan_IO_MonthFunded>J4*12,Loan_IO_MonthFunded<=K4*12),Loan_Amount-SUM($C$8:J8),0)))","v":0},{"$f":"IF(OR(Loan_IO_Status<>\"Fund Up\",Loan_IO_Approval=\"No\"),0,IF(L4*12<=Loan_IO_MonthFunded,VLOOKUP(L4,Amortization_Schedule_Annual,9,FALSE)-SUM($C$8:K8),IF(AND(Loan_IO_MonthFunded>K4*12,Loan_IO_MonthFunded<=L4*12),Loan_Amount-SUM($C$8:K8),0)))","v":0},{"$f":"IF(OR(Loan_IO_Status<>\"Fund Up\",Loan_IO_Approval=\"No\"),0,IF(M4*12<=Loan_IO_MonthFunded,VLOOKUP(M4,Amortization_Schedule_Annual,9,FALSE)-SUM($C$8:L8),IF(AND(Loan_IO_MonthFunded>L4*12,Loan_IO_MonthFunded<=M4*12),Loan_Amount-SUM($C$8:L8),0)))","v":0},{"$f":"SUM(C8:M8)","v":0}]
[null,"Refinance Proceeds",0,{"$f":"IF(Hold<D4,0,IF(ROUNDUP((Loan_IO_Term+1)/12,0)=D4,Loan_Amount_Amortizing-Loan_Amount,0))","v":0},0,0,0,0,0,0,0,0,0,0]
[null,"Equity Contributions",{"$f":"Equity_Amount","v":0},{"$f":"IF('Return Detail'!F85<0,-'Return Detail'!F85,0)","v":0},{"$f":"IF('Return Detail'!G85<0,-'Return Detail'!G85,0)","v":0},{"$f":"IF('Return Detail'!H85<0,-'Return Detail'!H85,0)","v":0},{"$f":"IF('Return Detail'!I85<0,-'Return Detail'!I85,0)","v":0},{"$f":"IF('Return Detail'!J85<0,-'Return Detail'!J85,0)","v":0},{"$f":"IF('Return Detail'!K85<0,-'Return Detail'!K85,0)","v":0},{"$f":"IF('Return Detail'!L85<0,-'Return Detail'!L85,0)","v":0},{"$f":"IF('Return Detail'!M85<0,-'Return Detail'!M85,0)","v":0},{"$f":"IF('Return Detail'!N85<0,-'Return Detail'!N85,0)","v":0},{"$f":"IF('Return Detail'!O85<0,-'Return Detail'!O85,0)","v":0},0]
{"$rows_left_out":30}
{"sheet":"Equity Investor Returns","index":11,"n_rows":188,"n_cols":27,"rows_kept":188,"cut":false,"hidden":false,"merged":[[187,1,187,13],[1,1,1,13],[5,4,5,5],[58,1,58,13],[59,1,59,13],[60,1,60,13],[61,1,61,13],[65,1,65,13],[67,1,67,13],[184,1,184,13],[185,1,185,13],[186,1,186,13]]}
[]
[null,{"$f":"IF(LEFT(B21,3)=\"Pre\",\"Pre-Tax Equity Investor Returns\",\"Post-Tax Equity Investor Returns\")","v":"Pre-Tax Equity Investor Returns"}]
[null,null,null,null,null,null,null,null,null,null,null,null,null,null,null,null,"Year",1,2,3,4,5,6,7,8,9,10]
[null,null,null,null,null,null,null,null,null,null,null,null,null,null,null,null,{"$f":"Name_Partner","v":"JV Partner"},{"$f":"E32","v":309063.82500000007},{"$f":"F32","v":493745.22899999999},508557.58587000007,523814.31344610004,539528.74284948304,555714.6051349676,572386.04328901658,589557.62458768708,607244.35332531773,5994007.80428199]
[null,null,null,null,null,null,null,null,null,null,null,null,null,null,null,null,{"$f":"Name_Developer","v":"Developer"},{"$f":"E47","v":206042.54999999996},{"$f":"F47","v":329163.48599999986},339038.39057999989,349209.54229739989,359685.82856632187,370476.4034233116,381590.69552601094,393038.41639179125,404829.568883545,5785520.5763069643]
[null,null,null,null,"Cash Flow Distribution"]
[null,null,"Method","Basis","Rate",{"$f":"Name_Partner&\" Split\"","v":"JV Partner Split"},{"$f":"Name_Developer&\" Split\"","v":"Developer Split"}]
[null,"Initial Equity Contribution",null,null,null,{"$f":"Contribution_JV","v":0.9},{"$f":"Contribution_Developer","v":0.1}]
[null,"Preferred Return","Cumulative","Cash on Cash",{"$f":"Equity_Rate","v":0.1},1,{"$f":"1-Pref_Investor","v":0}]
[null,"Hurdle 1",null,{"$f":"D9","v":"Cash on Cash"},{"$f":"Preferred_Return_Rate+0.02","v":0.12000000000000001},{"$f":"F8","v":0.9},{"$f":"1-F10","v":9.9999999999999978E-2}]
{"$rows_left_out":179}
{"sheet":"Holding Period Sensitivity","index":12,"n_rows":88,"n_cols":15,"rows_kept":88,"cut":false,"hidden":false,"merged":[[87,5,87,14],[86,5,86,14],[85,5,85,14],[2,1,2,14],[3,1,3,14]]}
[]
[]
[null,"Holding Period Sensitivity Analysis"]
[null,"These charts show the project's perfomanced based on Disposition year.  They assume continued financing regardless of term."]
[]
[]
[]
[]
[]
[]
{"$rows_left_out":78}