{"text_format":"1","workbook":"xlsx","n_sheets":11,"sheets":["Settings","Intro","Assumptions","Cash Flows","Summary Charts","Summary & Ratios","Return Detail","Loan Amortization","Sources & Uses","Equity Investor Returns","Holding Period Sensitivity"],"not_rendered":{"charts":10,"images":4,"macros":1,"external_links":0,"defined_names":111,"comments":0,"pivot_tables":0},"unopened":[],"bounds":{"document_bytes":16777216,"sheet_cells":100000,"rows_first":2000,"rows_last":500,"rows_between":2000,"halvings":0,"cell_chars":16384,"cell_head_chars":4096},"cells_cut":0,"cells_raw":0,"read":"whole","date_system":"1900"}

{"sheet":"Settings","index":0,"n_rows":79,"n_cols":30,"rows_kept":79,"cut":false,"hidden":true,"merged":[]}
["Version Number","Lock Workbooks:","BETA"]
[9.42,"Yes","No"]
[{"$f":"CONCATENATE(A2,\" H | © 2022\")","v":"9.42 H | © 2022"}]
[]
["View Options",1,1]
["Input View",null,"Show Periods"]
["Print View",null,"Show Dates"]
[]
["Summary Chart Data",null,1,2,3,4,5,6,7,8,9,10,null,"Amortizing Rate Structure",null,null,null,"Loan Costs Amortization"]
["Net Operating Income",null,{"$f":"'Sources & Uses'!D11","v":0},{"$f":"'Sources & Uses'!E11","v":942827.8474590003},{"$f":"'Sources & Uses'!F11","v":1048455.0582600001},{"$f":"'Sources & Uses'!G11","v":1090117.5094204997},{"$f":"'Sources & Uses'!H11","v":1186085.8466659591},{"$f":"'Sources & Uses'!I11","v":1225206.4804680652},{"$f":"'Sources & Uses'!J11","v":1251030.074419535},{"$f":"'Sources & Uses'!K11","v":1288561.3432617658},{"$f":"'Sources & Uses'!L11","v":1327219.0593493278},{"$f":"'Sources & Uses'!M11","v":1367036.5680211242},null,"Year","Step ","Rate",null,"Year","Start","End","I/O","Amortizing","Total"]
{"$rows_left_out":70}
{"sheet":"Intro","index":1,"n_rows":0,"n_cols":0,"rows_kept":0,"cut":false,"hidden":false,"merged":[]}

{"sheet":"Assumptions","index":2,"n_rows":57,"n_cols":8,"rows_kept":57,"cut":false,"hidden":false,"merged":[[54,5,54,7],[55,5,55,7],[56,5,56,7],[1,1,1,7],[36,1,36,3],[3,1,3,7],[36,5,36,7],[50,1,50,3],[30,1,30,3]]}
[]
[null,{"$f":"$D$7","v":"New Hospitality Project"}]
[]
[null,"Project Assumptions"]
[]
[null,"Property Information",null,null,null,"Acquisition Assumptions"]
[null,"Property Name",null,"New Hospitality Project",null,"Project Type",null,"New Construction"]
[null,"Location",null,null,null,{"$f":"IF(Project_Type=\"Acquisition\",\"Acquisition Cost\",\"Land Cost\")","v":"Land Cost"},null,914312]
[null,"Property Use",null,"Hospitality",null,{"$f":"IF(Project_Type=\"Acquisition\",\"Other Costs\",\"Hard Costs\")","v":"Hard Costs"},null,9541703]
[null,"Rooms",null,84,null,{"$f":"IF(Project_Type=\"Acquisition\",\"-\",\"Soft Costs\")","v":"Soft Costs"},null,1885128]
{"$rows_left_out":48}
{"sheet":"Cash Flows","index":3,"n_rows":192,"n_cols":16,"rows_kept":192,"cut":false,"hidden":false,"merged":[[191,1,191,15],[97,1,97,15],[98,1,98,15],[99,1,99,15],[189,1,189,15],[190,1,190,15]]}
[]
[]
[]
[]
[null,{"$f":"Project_Name&\" - Schedule of Cash Flows\"","v":"New Hospitality Project - Schedule of Cash Flows"}]
[]
[null,"Period",null,null,null,1,2,3,4,5,6,7,8,9,10,11]
[null,null,null,null,null,{"$f":"RPMDateSpan(F7,1)","v":"Jan 22 - Dec 22"},{"$f":"RPMDateSpan(G7,1)","v":"Jan 23 - Dec 23"},"Jan 24 - Dec 24","Jan 25 - Dec 25","Jan 26 - Dec 26","Jan 27 - Dec 27","Jan 28 - Dec 28","Jan 29 - Dec 29","Jan 30 - Dec 30","Jan 31 - Dec 31","Jan 32 - Dec 32"]
[]
[null,"Operating Statistics",null,null,"Inflation",null,0,0.03,{"$f":"H10","v":0.03},0.03,0.03,0.03,0.03,0.03,0.03,0.03]
{"$rows_left_out":183}
{"sheet":"Summary Charts","index":4,"n_rows":73,"n_cols":25,"rows_kept":73,"cut":false,"hidden":false,"merged":[[72,1,72,12],[2,1,2,12],[4,1,4,12],[69,1,69,12],[70,1,70,12],[71,1,71,12]]}
[]
[]
[null,{"$f":"Project_Name","v":"New Hospitality Project"}]
[]
[null,"Project Return Summary"]
[null,null,null,null,null,null,null,null,null,null,null,null,null,null,"Summary Chart Data",{"$f":"IF(DateView=1,P7,RPMDateSpan(P7,2))","v":1},2,3,4,5,6,7,8,9,10]
[null,"Summary",null,null,"Sale Analysis",null,null,"Cash Flows",null,null,null,"IRR & Present Value",null,null,"Period",1,2,3,4,5,6,7,8,9,10]
[null,"Units",{"$f":"Size_Total","v":84},null,{"$f":"IF(Project_Type=\"Acquisition\",\"Acquisition Price\",\"Development Cost\")","v":"Development Cost"},{"$f":"Acquisition_Gross","v":12341143},null,null,"Before Tax","After Tax",null,"Unleveraged IRR",{"$f":"'Return Detail'!$C$17","v":0.11685854397673934},null,"Net Operating Income",{"$f":"'Summary & Ratios'!D$10","v":-133713.75},{"$f":"'Summary & Ratios'!E$10","v":942827.8474590003},{"$f":"'Summary & Ratios'!F$10","v":1048455.0582600001},{"$f":"'Summary & Ratios'!G$10","v":1090117.5094204997},{"$f":"'Summary & Ratios'!H$10","v":1186085.8466659591},{"$f":"'Summary & Ratios'!I$10","v":1225206.4804680652},{"$f":"'Summary & Ratios'!J$10","v":1251030.074419535},{"$f":"'Summary & Ratios'!K$10","v":1288561.3432617658},{"$f":"'Summary & Ratios'!L$10","v":1327219.0593493278},{"$f":"'Summary & Ratios'!M$10","v":1367036.5680211242}]
[null,{"$f":"IF(Project_Type=\"Acquisition\",\"Acquisition Price\",\"Development Costs\")","v":"Development Costs"},{"$f":"Acquisition_Gross","v":12341143},null,"Per Unit",{"$f":"IFERROR(Acquisition_Gross/Size_Total,0)","v":146918.36904761905},null,"Operating Cash Flows",{"$f":"SUM('Return Detail'!$F$32:$O$32)","v":5221638.4779812507},{"$f":"SUM('Return Detail'!F83:O83)","v":3237818.9010360204},null,{"$f":"\"Unleveraged PV at \" &(Equity_Rate*100)&\"%\"","v":"Unleveraged PV at 8%"},{"$f":"'Return Detail'!$C$20","v":16400000},null,"Debt Serivce",{"$f":"IF(-'Summary & Ratios'!D$11=0,NA(),-'Summary & Ratios'!D$11)","v":{"$error":"#N/A"}},{"$f":"IF(-'Summary & Ratios'!E$11=0,NA(),-'Summary & Ratios'!E$11)","v":673207.02787777514},{"$f":"IF(-'Summary & Ratios'!F$11=0,NA(),-'Summary & Ratios'!F$11)","v":673207.02787777514},{"$f":"IF(-'Summary & Ratios'!G$11=0,NA(),-'Summary & Ratios'!G$11)","v":673207.02787777514},{"$f":"IF(-'Summary & Ratios'!H$11=0,NA(),-'Summary & Ratios'!H$11)","v":673207.02787777525},{"$f":"IF(-'Summary & Ratios'!I$11=0,NA(),-'Summary & Ratios'!I$11)","v":673207.02787777549},{"$f":"IF(-'Summary & Ratios'!J$11=0,NA(),-'Summary & Ratios'!J$11)","v":673207.0278777756},{"$f":"IF(-'Summary & Ratios'!K$11=0,NA(),-'Summary & Ratios'!K$11)","v":673207.02787777572},{"$f":"IF(-'Summary & Ratios'!L$11=0,NA(),-'Summary & Ratios'!L$11)","v":673207.02787777572},{"$f":"IF(-'Summary & Ratios'!M$11=0,NA(),-'Summary & Ratios'!M$11)","v":673207.02787777572}]
[null,"Other Costs",{"$f":"'Sources & Uses'!C19","v":0},null,"Sale Price",{"$f":"SUM('Return Detail'!F10:O10)","v":21128997.628177475},null,"Net Sale Proceeds",{"$f":"SUM('Return Detail'!$F$33:$O$36)","v":12256359.691508546},{"$f":"SUM('Return Detail'!F84:O84)","v":10583794.30272717},null,"Leveraged IRR",{"$f":"'Return Detail'!C42","v":0.22200865336552789},null,"Cash Flow After Taxes",{"$f":"'Return Detail'!F$83","v":168257.31031073999},{"$f":"'Return Detail'!G$83","v":131670.12921117351},{"$f":"'Return Detail'!H$83","v":197276.08445310636},{"$f":"'Return Detail'!I$83","v":221134.81682157659},{"$f":"'Return Detail'!J$83","v":280112.29569801147},{"$f":"'Return Detail'!K$83","v":301948.14011920814},{"$f":"'Return Detail'!L$83","v":314939.09986136615},{"$f":"'Return Detail'!M$83","v":335326.38557054783},{"$f":"'Return Detail'!N$83","v":356219.63201218907},{"$f":"'Return Detail'!O$83","v":930935.00697810133}]
{"$rows_left_out":64}
{"sheet":"Summary & Ratios","index":5,"n_rows":59,"n_cols":14,"rows_kept":59,"cut":false,"hidden":false,"merged":[[58,1,58,12]]}
[]
[null,{"$f":"Project_Name&\" - Summary & Ratios\"","v":"New Hospitality Project - Summary & Ratios"}]
[]
[null,null,null,1,2,3,4,5,6,7,8,9,10,"Total"]
[null,null,null,{"$f":"RPMDateSpan(D4,1)","v":"Jan 22 - Dec 22"},{"$f":"RPMDateSpan(E4,1)","v":"Jan 23 - Dec 23"},"Jan 24 - Dec 24","Jan 25 - Dec 25","Jan 26 - Dec 26","Jan 27 - Dec 27","Jan 28 - Dec 28","Jan 29 - Dec 29","Jan 30 - Dec 30","Jan 31 - Dec 31"]
[null,"Operating Summary"]
[null,"Effective Gross Income",null,{"$f":"'Cash Flows'!F40","v":0},{"$f":"'Cash Flows'!G40","v":2106779.8910000003},{"$f":"'Cash Flows'!H40","v":2339887.5020000003},{"$f":"'Cash Flows'!I40","v":2504821.5034999996},{"$f":"'Cash Flows'!J40","v":2677442.382844999},{"$f":"'Cash Flows'!K40","v":2757765.6543303491},{"$f":"'Cash Flows'!L40","v":2840498.6239602608},{"$f":"'Cash Flows'!M40","v":2925713.9760370562},{"$f":"'Cash Flows'!N40","v":3013486.3350066971},{"$f":"'Cash Flows'!O40","v":3103891.9303050921},{"$f":"SUM(D7:M7)","v":24270287.798984453}]
[null,"Operating Expenses",null,{"$f":"-'Cash Flows'!F76","v":-133713.75},{"$f":"-'Cash Flows'!G76","v":-1109550.043541},{"$f":"-'Cash Flows'!H76","v":-1235398.3837400002},{"$f":"-'Cash Flows'!I76","v":-1356988.9122794999},{"$f":"-'Cash Flows'!J76","v":-1431910.0019250398},{"$f":"-'Cash Flows'!K76","v":-1471329.2435806638},{"$f":"-'Cash Flows'!L76","v":-1526401.7213506571},{"$f":"-'Cash Flows'!M76","v":-1572193.7997395198},{"$f":"-'Cash Flows'!N76","v":-1619359.6776305255},{"$f":"-'Cash Flows'!O76","v":-1667940.5363163187},{"$f":"SUM(D8:M8)","v":-13124786.070103224}]
[null,"Operating Reserves",null,{"$f":"-'Cash Flows'!F87","v":0},{"$f":"-'Cash Flows'!G87","v":-54402},{"$f":"-'Cash Flows'!H87","v":-56034.060000000005},{"$f":"-'Cash Flows'!I87","v":-57715.081800000007},{"$f":"-'Cash Flows'!J87","v":-59446.534254000006},{"$f":"-'Cash Flows'!K87","v":-61229.930281620007},{"$f":"-'Cash Flows'!L87","v":-63066.828190068612},{"$f":"-'Cash Flows'!M87","v":-64958.833035770673},{"$f":"-'Cash Flows'!N87","v":-66907.5980268438},{"$f":"-'Cash Flows'!O87","v":-68914.825967649114},-552675.69155595219]
[null,"Net Operating Income",null,{"$f":"'Cash Flows'!F89","v":-133713.75},{"$f":"'Cash Flows'!G89","v":942827.8474590003},{"$f":"'Cash Flows'!H89","v":1048455.0582600001},{"$f":"'Cash Flows'!I89","v":1090117.5094204997},{"$f":"'Cash Flows'!J89","v":1186085.8466659591},{"$f":"'Cash Flows'!K89","v":1225206.4804680652},{"$f":"'Cash Flows'!L89","v":1251030.074419535},{"$f":"'Cash Flows'!M89","v":1288561.3432617658},{"$f":"'Cash Flows'!N89","v":1327219.0593493278},{"$f":"'Cash Flows'!O89","v":1367036.5680211242},10592826.037325278]
{"$rows_left_out":50}
{"sheet":"Return Detail","index":6,"n_rows":105,"n_cols":15,"rows_kept":105,"cut":false,"hidden":false,"merged":[[1,1,1,14],[104,1,104,14]]}
[]
[null,{"$f":"Project_Name&\" - Project Return Details\"","v":"New Hospitality Project - Project Return Details"}]
[]
[null,"Unlevered Returns"]
[null,null,null,null,null,1,2,3,4,5,6,7,8,9,10]
[null,"Net Operating Income",null,null,null,{"$f":"IF(F$5<=Hold,'Cash Flows'!F$89,0)","v":-133713.75},{"$f":"IF(G$5<=Hold,'Cash Flows'!G$89,0)","v":942827.8474590003},{"$f":"IF(H$5<=Hold,'Cash Flows'!H$89,0)","v":1048455.0582600001},{"$f":"IF(I$5<=Hold,'Cash Flows'!I$89,0)","v":1090117.5094204997},{"$f":"IF(J$5<=Hold,'Cash Flows'!J$89,0)","v":1186085.8466659591},{"$f":"IF(K$5<=Hold,'Cash Flows'!K$89,0)","v":1225206.4804680652},{"$f":"IF(L$5<=Hold,'Cash Flows'!L$89,0)","v":1251030.074419535},{"$f":"IF(M$5<=Hold,'Cash Flows'!M$89,0)","v":1288561.3432617658},{"$f":"IF(N$5<=Hold,'Cash Flows'!N$89,0)","v":1327219.0593493278},{"$f":"IF(O$5<=Hold,'Cash Flows'!O$89,0)","v":1367036.5680211242}]
[null,"Less: Net Capital Expenses",null,null,null,{"$f":"IF(F$5<=Hold,'Cash Flows'!F$135*-1,0)","v":0},{"$f":"IF(G$5<=Hold,'Cash Flows'!G$135*-1,0)","v":0},{"$f":"IF(H$5<=Hold,'Cash Flows'!H$135*-1,0)","v":0},{"$f":"IF(I$5<=Hold,'Cash Flows'!I$135*-1,0)","v":0},{"$f":"IF(J$5<=Hold,'Cash Flows'!J$135*-1,0)","v":0},{"$f":"IF(K$5<=Hold,'Cash Flows'!K$135*-1,0)","v":0},{"$f":"IF(L$5<=Hold,'Cash Flows'!L$135*-1,0)","v":0},{"$f":"IF(M$5<=Hold,'Cash Flows'!M$135*-1,0)","v":0},{"$f":"IF(N$5<=Hold,'Cash Flows'!N$135*-1,0)","v":0},{"$f":"IF(O$5<=Hold,'Cash Flows'!O$135*-1,0)","v":0}]
[null,"Non-Regular Income",null,null,null,{"$f":"IF(F5>Hold,0,'Cash Flows'!F142)","v":133713.75},{"$f":"IF(G5>Hold,0,'Cash Flows'!G142)","v":0},{"$f":"IF(H5>Hold,0,'Cash Flows'!H142)","v":0},{"$f":"IF(I5>Hold,0,'Cash Flows'!I142)","v":0},{"$f":"IF(J5>Hold,0,'Cash Flows'!J142)","v":0},{"$f":"IF(K5>Hold,0,'Cash Flows'!K142)","v":0},{"$f":"IF(L5>Hold,0,'Cash Flows'!L142)","v":0},{"$f":"IF(M5>Hold,0,'Cash Flows'!M142)","v":0},{"$f":"IF(N5>Hold,0,'Cash Flows'!N142)","v":0},{"$f":"IF(O5>Hold,0,'Cash Flows'!O142)","v":553961.94155595219}]
[null,"Operating Cash Flow",null,null,null,{"$f":"SUM(F6:F8)","v":0},{"$f":"SUM(G6:G8)","v":942827.8474590003},1048455.0582600001,1090117.5094204997,1186085.8466659591,1225206.4804680652,1251030.074419535,1288561.3432617658,1327219.0593493278,1920998.5095770764]
[null,"Reversion Cash Flow",null,null,null,{"$f":"IFERROR(IF(F$5=Hold,IF(Disposition=\"Cap Rate\",'Cash Flows'!G$81/Exit_Rate,FV(Exit_Rate,Hold,0,-Acquisition_Gross)),0),0)","v":0},{"$f":"IFERROR(IF(G$5=Hold,IF(Disposition=\"Cap Rate\",'Cash Flows'!H$81/Exit_Rate,FV(Exit_Rate,Hold,0,-Acquisition_Gross)),0),0)","v":0},{"$f":"IFERROR(IF(H$5=Hold,IF(Disposition=\"Cap Rate\",'Cash Flows'!I$81/Exit_Rate,FV(Exit_Rate,Hold,0,-Acquisition_Gross)),0),0)","v":0},{"$f":"IFERROR(IF(I$5=Hold,IF(Disposition=\"Cap Rate\",'Cash Flows'!J$81/Exit_Rate,FV(Exit_Rate,Hold,0,-Acquisition_Gross)),0),0)","v":0},{"$f":"IFERROR(IF(J$5=Hold,IF(Disposition=\"Cap Rate\",'Cash Flows'!K$81/Exit_Rate,FV(Exit_Rate,Hold,0,-Acquisition_Gross)),0),0)","v":0},{"$f":"IFERROR(IF(K$5=Hold,IF(Disposition=\"Cap Rate\",'Cash Flows'!L$81/Exit_Rate,FV(Exit_Rate,Hold,0,-Acquisition_Gross)),0),0)","v":0},{"$f":"IFERROR(IF(L$5=Hold,IF(Disposition=\"Cap Rate\",'Cash Flows'!M$81/Exit_Rate,FV(Exit_Rate,Hold,0,-Acquisition_Gross)),0),0)","v":0},{"$f":"IFERROR(IF(M$5=Hold,IF(Disposition=\"Cap Rate\",'Cash Flows'!N$81/Exit_Rate,FV(Exit_Rate,Hold,0,-Acquisition_Gross)),0),0)","v":0},{"$f":"IFERROR(IF(N$5=Hold,IF(Disposition=\"Cap Rate\",'Cash Flows'!O$81/Exit_Rate,FV(Exit_Rate,Hold,0,-Acquisition_Gross)),0),0)","v":0},{"$f":"IFERROR(IF(O$5=Hold,IF(Disposition=\"Cap Rate\",'Cash Flows'!P$81/Exit_Rate,FV(Exit_Rate,Hold,0,-Acquisition_Gross)),0),0)","v":21128997.628177475}]
{"$rows_left_out":96}
{"sheet":"Loan Amortization","index":7,"n_rows":170,"n_cols":15,"rows_kept":170,"cut":false,"hidden":false,"merged":[[45,8,45,9],[2,1,2,9],[4,7,4,8],[43,8,43,9],[44,8,44,9],[4,2,4,3]]}
[]
[]
[null,{"$f":"Project_Name&\" - Loan Amortization Schedule\"","v":"New Hospitality Project - Loan Amortization Schedule"}]
[]
[null,null,"Interest Only Loan",null,null,null,null,"Amortizing Loan"]
[null,null,"Loan Amount",{"$f":"IF(Loan_IO_Approval=\"no\",\"-\",Loan_Amount)","v":9357107.25},null,null,null,"Loan Amount",{"$f":"Loan_Amount_Amortizing","v":9357107.25}]
[null,null,"Term",{"$f":"IF(Loan_IO_Approval=\"no\",\"-\",Loan_IO_Term)","v":12},null,null,null,"Term",{"$f":"Loan_Amor_Term","v":360}]
[null,null,"Rate",{"$f":"IF(Loan_IO_Approval=\"no\",\"-\",Loan_IO_Rate)","v":0.06},null,null,null,"Amortization",{"$f":"Loan_Amortization","v":360}]
[null,null,"Funding Status",{"$f":"IF(Loan_IO_Approval=\"no\",\"-\",IF(Loan_IO_Status=0,\"Fund Up (Default)\",Loan_IO_Status))","v":"Fund Up"},null,null,null,"Rate",{"$f":"Loan_Amor_Rate","v":0.06}]
[null,null,null,null,null,null,null,"Rate Type",{"$f":"Loan_Amor_Type","v":"Fixed"}]
{"$rows_left_out":161}
{"sheet":"Sources & Uses","index":8,"n_rows":39,"n_cols":14,"rows_kept":39,"cut":false,"hidden":false,"merged":[[36,1,36,13],[37,1,37,13],[38,1,38,13]]}
[]
[null,{"$f":"Project_Name&\" - Sources & Uses\"","v":"New Hospitality Project - Sources & Uses"}]
[]
[null,"Period",0,1,2,3,4,5,6,7,8,9,10,"Total"]
[null,null,null,{"$f":"RPMDateSpan(D4,1)","v":"Jan 22 - Dec 22"},{"$f":"RPMDateSpan(E4,1)","v":"Jan 23 - Dec 23"},"Jan 24 - Dec 24","Jan 25 - Dec 25","Jan 26 - Dec 26","Jan 27 - Dec 27","Jan 28 - Dec 28","Jan 29 - Dec 29","Jan 30 - Dec 30","Jan 31 - Dec 31"]
[]
[null,"Sources Of Capital"]
[null,"Debt Proceeds",{"$f":"IF(AND(Loan_IO_Status=\"Fund Up\",Loan_IO_Term>0,Loan_IO_Approval=\"Yes\"),0,Loan_Amount)","v":0},{"$f":"IF(OR(Loan_IO_Status<>\"Fund Up\",Loan_IO_Approval=\"No\"),0,IF(D4*12<=Loan_IO_MonthFunded,VLOOKUP(D4,Amortization_Schedule_Annual,9,FALSE)-SUM($C$8:C8),IF(AND(Loan_IO_MonthFunded>C4*12,Loan_IO_MonthFunded<=D4*12),Loan_Amount-SUM($C$8:C8),0)))","v":9357107.25},{"$f":"IF(OR(Loan_IO_Status<>\"Fund Up\",Loan_IO_Approval=\"No\"),0,IF(E4*12<=Loan_IO_MonthFunded,VLOOKUP(E4,Amortization_Schedule_Annual,9,FALSE)-SUM($C$8:D8),IF(AND(Loan_IO_MonthFunded>D4*12,Loan_IO_MonthFunded<=E4*12),Loan_Amount-SUM($C$8:D8),0)))","v":0},{"$f":"IF(OR(Loan_IO_Status<>\"Fund Up\",Loan_IO_Approval=\"No\"),0,IF(F4*12<=Loan_IO_MonthFunded,VLOOKUP(F4,Amortization_Schedule_Annual,9,FALSE)-SUM($C$8:E8),IF(AND(Loan_IO_MonthFunded>E4*12,Loan_IO_MonthFunded<=F4*12),Loan_Amount-SUM($C$8:E8),0)))","v":0},{"$f":"IF(OR(Loan_IO_Status<>\"Fund Up\",Loan_IO_Approval=\"No\"),0,IF(G4*12<=Loan_IO_MonthFunded,VLOOKUP(G4,Amortization_Schedule_Annual,9,FALSE)-SUM($C$8:F8),IF(AND(Loan_IO_MonthFunded>F4*12,Loan_IO_MonthFunded<=G4*12),Loan_Amount-SUM($C$8:F8),0)))","v":0},{"$f":"IF(OR(Loan_IO_Status<>\"Fund Up\",Loan_IO_Approval=\"No\"),0,IF(H4*12<=Loan_IO_MonthFunded,VLOOKUP(H4,Amortization_Schedule_Annual,9,FALSE)-SUM($C$8:G8),IF(AND(Loan_IO_MonthFunded>G4*12,Loan_IO_MonthFunded<=H4*12),Loan_Amount-SUM($C$8:G8),0)))","v":0},{"$f":"IF(OR(Loan_IO_Status<>\"Fund Up\",Loan_IO_Approval=\"No\"),0,IF(I4*12<=Loan_IO_MonthFunded,VLOOKUP(I4,Amortization_Schedule_Annual,9,FALSE)-SUM($C$8:H8),IF(AND(Loan_IO_MonthFunded>H4*12,Loan_IO_MonthFunded<=I4*12),Loan_Amount-SUM($C$8:H8),0)))","v":0},{"$f":"IF(OR(Loan_IO_Status<>\"Fund Up\",Loan_IO_Approval=\"No\"),0,IF(J4*12<=Loan_IO_MonthFunded,VLOOKUP(J4,Amortization_Schedule_Annual,9,FALSE)-SUM($C$8:I8),IF(AND(Loan_IO_MonthFunded>I4*12,Loan_IO_MonthFunded<=J4*12),Loan_Amount-SUM($C$8:I8),0)))","v":0},{"$f":"IF(OR(Loan_IO_Status<>\"Fund Up\",Loan_IO_Approval=\"No\"),0,IF(K4*12<=Loan_IO_MonthFunded,VLOOKUP(K4,Amortization_Schedule_Annual,9,FALSE)-SUM($C$8:J8),IF(AND(Loan_IO_MonthFunded>J4*12,Loan_IO_MonthFunded<=K4*12),Loan_Amount-SUM($C$8:J8),0)))","v":0},{"$f":"IF(OR(Loan_IO_Status<>\"Fund Up\",Loan_IO_Approval=\"No\"),0,IF(L4*12<=Loan_IO_MonthFunded,VLOOKUP(L4,Amortization_Schedule_Annual,9,FALSE)-SUM($C$8:K8),IF(AND(Loan_IO_MonthFunded>K4*12,Loan_IO_MonthFunded<=L4*12),Loan_Amount-SUM($C$8:K8),0)))","v":0},{"$f":"IF(OR(Loan_IO_Status<>\"Fund Up\",Loan_IO_Approval=\"No\"),0,IF(M4*12<=Loan_IO_MonthFunded,VLOOKUP(M4,Amortization_Schedule_Annual,9,FALSE)-SUM($C$8:L8),IF(AND(Loan_IO_MonthFunded>L4*12,Loan_IO_MonthFunded<=M4*12),Loan_Amount-SUM($C$8:L8),0)))","v":0},{"$f":"SUM(C8:M8)","v":9357107.25}]
[null,"Refinance Proceeds",0,{"$f":"IF(Hold<D4,0,IF(ROUNDUP((Loan_IO_Term+1)/12,0)=D4,Loan_Amount_Amortizing-Loan_Amount,0))","v":0},0,0,0,0,0,0,0,0,0,0]
[null,"Equity Contributions",{"$f":"Equity_Amount","v":3119035.75},{"$f":"IF('Return Detail'!F85<0,-'Return Detail'!F85,0)","v":0},{"$f":"IF('Return Detail'!G85<0,-'Return Detail'!G85,0)","v":0},{"$f":"IF('Return Detail'!H85<0,-'Return Detail'!H85,0)","v":0},{"$f":"IF('Return Detail'!I85<0,-'Return Detail'!I85,0)","v":0},{"$f":"IF('Return Detail'!J85<0,-'Return Detail'!J85,0)","v":0},{"$f":"IF('Return Detail'!K85<0,-'Return Detail'!K85,0)","v":0},{"$f":"IF('Return Detail'!L85<0,-'Return Detail'!L85,0)","v":0},{"$f":"IF('Return Detail'!M85<0,-'Return Detail'!M85,0)","v":0},{"$f":"IF('Return Detail'!N85<0,-'Return Detail'!N85,0)","v":0},{"$f":"IF('Return Detail'!O85<0,-'Return Detail'!O85,0)","v":0},3119035.75]
{"$rows_left_out":30}
{"sheet":"Equity Investor Returns","index":9,"n_rows":188,"n_cols":27,"rows_kept":188,"cut":false,"hidden":false,"merged":[[187,1,187,13],[1,1,1,13],[5,4,5,5],[58,1,58,13],[59,1,59,13],[60,1,60,13],[61,1,61,13],[65,1,65,13],[67,1,67,13],[184,1,184,13],[185,1,185,13],[186,1,186,13]]}
[]
[null,{"$f":"Project_Name&\" - \"&IF(LEFT(B21,3)=\"Pre\",\"Pre-Tax Equity Investor Returns\",\"Post-Tax Equity Investor Returns\")","v":"New Hospitality Project - Pre-Tax Equity Investor Returns"}]
[null,null,null,null,null,null,null,null,null,null,null,null,null,null,null,null,"Year",1,2,3,4,5,6,7,8,9,10]
[null,null,null,null,null,null,null,null,null,null,null,null,null,null,null,null,{"$f":"Name_Partner","v":"Equity Investor"},{"$f":"E32","v":0},{"$f":"F32","v":242130.95486877239},336988.67932452925,361790.4218672206,381102.73458034103,400663.05148139398,413574.8484571288,432340.48287824413,451669.34092202515,6876738.9117901726]
[null,null,null,null,null,null,null,null,null,null,null,null,null,null,null,null,{"$f":"Name_Developer","v":"Developer"},{"$f":"E47","v":0},{"$f":"F47","v":25440.726998450002},25440.726998450002,44547.094450302429,131776.08420784282,151336.40110889578,164248.1980846306,183013.83250574593,202342.69054952695,6627412.2614176748]
[null,null,null,null,"Cash Flow Distribution"]
[null,null,"Method","Basis","Rate",{"$f":"Name_Partner& \"Split\"","v":"Equity InvestorSplit"},{"$f":"Name_Developer&\" Split\"","v":"Developer Split"}]
[null,"Initial Equity Contribution",null,null,null,{"$f":"Contribution_JV","v":0.89804249999999997},{"$f":"Contribution_Developer","v":0.10195750000000001}]
[null,"Preferred Return","Cumulative","Cash on Cash",{"$f":"Equity_Rate","v":0.08},{"$f":"Contribution_JV","v":0.89804249999999997},{"$f":"1-Pref_Investor","v":0.10195750000000003}]
[null,"Hurdle 1",null,{"$f":"D9","v":"Cash on Cash"},{"$f":"Preferred_Return_Rate+0.02","v":0.1},0.7,{"$f":"1-F10","v":0.30000000000000004}]
{"$rows_left_out":179}
{"sheet":"Holding Period Sensitivity","index":10,"n_rows":89,"n_cols":15,"rows_kept":89,"cut":false,"hidden":false,"merged":[[88,1,88,2],[2,1,2,14],[3,1,3,14]]}
[]
[]
[null,{"$f":"Project_Name&\" - Holding Period Sensitivity Analysis\"","v":"New Hospitality Project - Holding Period Sensitivity Analysis"}]
[null,"These charts show the project's perfomanced based on Disposition year.  They assume continued financing regardless of term."]
[]
[]
[]
[]
[]
[]
{"$rows_left_out":79}