{"text_format":"1","workbook":"xlsx","n_sheets":14,"sheets":["Settings","Intro","Assumptions","Rent Roll","Leasing Costs Calculator","Rent Roll Summary","Cash Flows","Summary Charts","Summary & Ratios","Return Detail","Loan Amortization","Sources & Uses","Equity Investor Returns","Holding Period Sensitivity"],"not_rendered":{"charts":11,"images":6,"macros":1,"external_links":0,"defined_names":124,"comments":0,"pivot_tables":0},"unopened":[],"bounds":{"document_bytes":16777216,"sheet_cells":100000,"rows_first":2000,"rows_last":500,"rows_between":2000,"halvings":0,"cell_chars":16384,"cell_head_chars":4096},"cells_cut":0,"cells_raw":0,"read":"whole","date_system":"1900"}

{"sheet":"Settings","index":0,"n_rows":411,"n_cols":30,"rows_kept":411,"cut":false,"hidden":true,"merged":[[43,0,45,0],[46,0,47,0]]}
["Version Number","Lock Worksheets:","Beta"]
[9.42,"Yes","No"]
[{"$f":"CONCATENATE(A2,\" C | © 2022\")","v":"9.42 C | © 2022"}]
[]
["View Options",1,1]
["Input View",null,"Show Periods"]
["Print View",null,"Show Dates"]
[]
[null,null,null,null,null,null,null,null,null,null,null,null,null,"Amortizing Rate Structure",null,null,null,"Loan Costs Amortization"]
["Summary Chart Data",null,1,2,3,4,5,6,7,8,9,10,null,"Year","Step ","Rate",null,"Year","Start","End","I/O","Amortizing","Total"]
{"$rows_left_out":402}
{"sheet":"Intro","index":1,"n_rows":3,"n_cols":1,"rows_kept":3,"cut":false,"hidden":false,"merged":[[31,2,31,8]]}
[]
[9.42]
[{"$f":"CONCATENATE(A2,\" C | © 2022\")","v":"9.42 C | © 2022"}]

{"sheet":"Assumptions","index":2,"n_rows":57,"n_cols":8,"rows_kept":57,"cut":false,"hidden":false,"merged":[[1,1,1,7],[30,1,30,3],[36,5,36,7],[50,1,50,3],[56,5,56,7],[54,5,54,7],[55,5,55,7],[36,1,36,3],[3,1,3,7]]}
[]
[null,{"$f":"Project_Name","v":"New Commercial Model"}]
[]
[null,"Project Assumptions"]
[]
[null,"Property Information",null,null,null,"Acquisition Assumptions"]
[null,"Property Name",null,"New Commercial Model",null,"Project Type",null,"Acquisition"]
[null,"Location",null,null,null,{"$f":"IF(Project_Type=\"Acquisition\",\"Acquisition Cost\",\"Land Cost\")","v":"Acquisition Cost"},null,1800000]
[null,"Property Use",null,"Commercial",null,{"$f":"IF(Project_Type=\"Acquisition\",\"Other Costs\",\"Hard Costs\")","v":"Other Costs"},null,100000]
[null,"Square Feet",null,11200,null,{"$f":"IF(Project_Type=\"Acquisition\",\"-\",\"Soft Costs\")","v":"-"},null,0]
{"$rows_left_out":48}
{"sheet":"Rent Roll","index":3,"n_rows":14,"n_cols":12,"rows_kept":14,"cut":false,"hidden":false,"merged":[[2,1,2,16]]}
[]
[]
[null,{"$f":"Project_Name&\" - Rent Roll\"","v":"New Commercial Model - Rent Roll"}]
[null,"Total Square Feet",null,{"$f":"Size_Total","v":11200},{"$f":"D4/Size_Total","v":1}]
[null,{"$f":"\"Current Leased (As of \"&TEXT(Analysis_Begin,\"mmm yyyy\")&\")\"","v":"Current Leased (As of Jan 2022)"},null,{"$f":"'Rent Roll Summary'!D43","v":11200},{"$f":"D5/Size_Total","v":1}]
[null,"Vacant",null,{"$f":"SUM('Rent Roll Summary'!$F$43,'Rent Roll Summary'!$M$43)","v":0},{"$f":"D6/Size_Total","v":0}]
[]
[]
[null,"Suite","Tenant","Square Feet","% SF","Status","Lease Start","Lease Expiration","Total Months","Rent PSF","Monthly Rent","Annual Rent"]
[null,100,"Example Tenant 1",4300,{"$f":"Rent_Roll[[#This Row],[Square Feet]]/Size_Total","v":0.38392857142857145},"Current","1993-07-01","2025-12-31",{"$f":"IFERROR(ROUND(YEARFRAC(G10,H10,1)*12,0),\"-\")","v":390},18,{"$f":"L10/12","v":6450},{"$f":"J10*D10","v":77400}]
{"$rows_left_out":5}
{"sheet":"Leasing Costs Calculator","index":4,"n_rows":74,"n_cols":20,"rows_kept":74,"cut":false,"hidden":false,"merged":[[32,2,32,8],[2,2,2,8],[3,13,3,19],[4,2,4,6],[6,2,6,3],[7,2,7,3],[8,2,8,3],[10,2,10,3],[13,2,13,3],[14,2,14,3],[16,2,16,5],[18,13,18,19],[73,2,73,8],[33,13,33,19],[44,2,44,8],[49,2,49,8],[55,2,55,8],[71,2,71,8],[72,2,72,8]]}
[]
[]
[null,null,"Annual Leasing Costs"]
[null,null,null,null,null,null,null,null,null,null,null,null,null,"Current Rent Roll Expirations"]
[null,null,"Cost Assumptions",null,null,null,null,null,null,null,null,null,null,"Period","Year","Square Feet","%","TI Expense","LC Expense","Concessions"]
[null,null,null,null,"New Tenant","Renewal","Weighted Avg",null,null,null,null,null,null,1,{"$f":"YEAR(Analysis_Begin)","v":2022},{"$f":"SUM(OFFSET('Rent Roll Summary'!$I$43,(N6-1)*12,0,12,1))","v":0},{"$f":"P6/Size_Total","v":0},{"$f":"P6*$I$43","v":0},{"$f":"P6*$I$49","v":0},{"$f":"P6*$I$54","v":0}]
[null,null,"Renewal Probability",null,0.25,{"$f":"1-E7","v":0.75},{"$f":"SUM(E7:F7)","v":1},null,null,null,null,null,null,2,{"$f":"O6+1","v":2023},{"$f":"SUM(OFFSET('Rent Roll Summary'!$I$43,(N7-1)*12,0,12,1))","v":0},{"$f":"P7/Size_Total","v":0},0,0,0]
[null,null,"Avg. Annual Rental Rate PSF",null,20,20,{"$f":"SUMPRODUCT($E$7:$F$7,E8:F8)","v":20},null,null,null,null,null,null,3,2024,{"$f":"SUM(OFFSET('Rent Roll Summary'!$I$43,(N8-1)*12,0,12,1))","v":3800},{"$f":"P8/Size_Total","v":0.3392857142857143},36416.666666666672,12540,1583.3333333333333]
[null,null,"Average Lease Term",null,5,3,{"$f":"SUMPRODUCT($E$7:$F$7,E9:F9)","v":3.5},null,null,null,null,null,null,4,2025,{"$f":"SUM(OFFSET('Rent Roll Summary'!$I$43,(N9-1)*12,0,12,1))","v":0},{"$f":"P9/Size_Total","v":0},0,0,0]
[null,null,"Tenant Improvements",null,null,null,null,null,null,null,null,null,null,5,2026,{"$f":"SUM(OFFSET('Rent Roll Summary'!$I$43,(N10-1)*12,0,12,1))","v":4300},{"$f":"P10/Size_Total","v":0.38392857142857145},41208.333333333336,14190,1791.6666666666665]
{"$rows_left_out":65}
{"sheet":"Rent Roll Summary","index":5,"n_rows":174,"n_cols":12,"rows_kept":174,"cut":false,"hidden":false,"merged":[[40,1,40,11],[4,1,4,10],[2,1,2,10]]}
[]
[]
[null,{"$f":"Project_Name&\" Rent Roll Summary\"","v":"New Commercial Model Rent Roll Summary"}]
[]
[null,"Annual Summary"]
[null,"Period","Year","Occupied SF","Vacancy","Occupied Rent","Vacant Rent","Avg Rent PSF","Concessions","Tenant Improvements","Leasing Commissions","Vacancy Change"]
[null,1,{"$f":"RPMDateSpan(B7,1)","v":"Jan 22 - Dec 22"},{"$f":"AVERAGE(OFFSET($D$43:$D$54,($B7-1)*12,0))","v":11200},{"$f":"1-(D7/Size_Total)","v":0},{"$f":"SUM(OFFSET($E$43,($B7-1)*12,0,12,1))","v":219700.00000000003},{"$f":"SUM(OFFSET($H$43,($B7-1)*12,0,12,1))","v":0},{"$f":"SUM(F7:G7)/Size_Total","v":19.616071428571431},{"$f":"SUM(OFFSET($J$43,(($B7-1)*12),0,12,1))","v":0},{"$f":"SUM(OFFSET($K$43,($B7-1)*12,0,12,1))","v":0},{"$f":"SUM(OFFSET($L$43,($B7-1)*12,0,12,1))","v":0},{"$f":"E7","v":0}]
[null,2,{"$f":"RPMDateSpan(B8,1)","v":"Jan 23 - Dec 23"},{"$f":"AVERAGE(OFFSET($D$43:$D$54,($B8-1)*12,0))","v":11200},0,219700.00000000003,{"$f":"SUM(OFFSET($H$43,($B8-1)*12,0,12,1))","v":0},19.616071428571431,0,0,0,{"$f":"E8-E7","v":0}]
[null,3,"Jan 24 - Dec 24",7400,0.3392857142857143,145599.99999999997,80629.965599999996,20.199104071428568,1583.3333333333333,36416.666666666672,12540,{"$f":"E9-E8","v":0.3392857142857143}]
[null,4,"Jan 25 - Dec 25",7400,0.3392857142857143,145599.99999999997,83048.817600000009,20.415073,0,0,0,0]
{"$rows_left_out":165}
{"sheet":"Cash Flows","index":6,"n_rows":160,"n_cols":16,"rows_kept":160,"cut":false,"hidden":false,"merged":[[157,1,157,15],[158,1,158,15],[159,1,159,15],[66,1,66,15],[67,1,67,15],[68,1,68,15]]}
[]
[]
[]
[]
[null,"Schedule of Prospective Cash Flows"]
[]
[null,"Period",null,null,null,1,2,3,4,5,6,7,8,9,10,11]
[null,null,null,null,null,{"$f":"RPMDateSpan(F7,1)","v":"Jan 22 - Dec 22"},{"$f":"RPMDateSpan(G7,1)","v":"Jan 23 - Dec 23"},"Jan 24 - Dec 24","Jan 25 - Dec 25","Jan 26 - Dec 26","Jan 27 - Dec 27","Jan 28 - Dec 28","Jan 29 - Dec 29","Jan 30 - Dec 30","Jan 31 - Dec 31","Jan 32 - Dec 32"]
[]
[null,"Operating Income",null,null,"Inflation",null,{"$f":"Inflation","v":0.03},{"$f":"G10","v":0.03},0.03,0.03,0.03,0.03,0.03,0.03,0.03,0.03]
{"$rows_left_out":151}
{"sheet":"Summary Charts","index":7,"n_rows":73,"n_cols":25,"rows_kept":73,"cut":false,"hidden":false,"merged":[[72,1,72,12],[2,1,2,12],[4,1,4,12],[69,1,69,12],[70,1,70,12],[71,1,71,12]]}
[]
[]
[null,{"$f":"Project_Name","v":"New Commercial Model"}]
[]
[null,"Project Return Summary"]
[null,null,null,null,null,null,null,null,null,null,null,null,null,null,"Date Range Display",{"$f":"IF(Date_View=1,P7,RPMDateSpan(P7,2))","v":1},2,3,4,5,6,7,8,9,10]
[null,"Summary",null,null,"Sale Analysis",null,null,"Cash Flows",null,null,null,"IRR & Present Value",null,null,"Summary Chart Data",1,2,3,4,5,6,7,8,9,10]
[null,"Square Feet",{"$f":"Size_Total","v":11200},null,{"$f":"IF(Project_Type=\"Acquisition\",\"Acquisition Price\",\"Development Cost\")","v":"Acquisition Price"},{"$f":"Acquisition_Gross","v":1900000},null,null,"Before Tax","After Tax",null,"Unleveraged IRR",{"$f":"'Return Detail'!$C$17","v":7.599765918980661E-2},null,"Net Operating Income",{"$f":"'Summary & Ratios'!D$10","v":118520.80000000002},{"$f":"'Summary & Ratios'!E$10","v":116681.80000000002},{"$f":"'Summary & Ratios'!F$10","v":88965.52027839997},{"$f":"'Summary & Ratios'!G$10","v":120568.41330639998},{"$f":"'Summary & Ratios'!H$10","v":101861.31789580006},{"$f":"'Summary & Ratios'!I$10","v":140118.41942460998},{"$f":"'Summary & Ratios'!J$10","v":142856.47701317229},{"$f":"'Summary & Ratios'!K$10","v":126967.13609425546},{"$f":"'Summary & Ratios'!L$10","v":157513.83136133914},{"$f":"'Summary & Ratios'!M$10","v":162539.96393366726}]
[null,{"$f":"IF(Project_Type=\"Acquisition\",\"Acquisition Price\",\"Development Costs\")","v":"Acquisition Price"},{"$f":"Acquisition_Gross","v":1900000},null,"PSF",{"$f":"IFERROR(Acquisition_Gross/Size_Total,\"-\")","v":169.64285714285714},null,"Annual Cash Flows",{"$f":"SUM('Return Detail'!$F$32:$O$32)","v":115401.00758848846},{"$f":"SUM('Return Detail'!F83:O83)","v":-9023.6161116899966},null,{"$f":"\"Unleveraged PV at \" &(Equity_Rate*100)&\"%\"","v":"Unleveraged PV at 10%"},{"$f":"'Return Detail'!$C$20","v":1670000},null,"Debt Service",{"$f":"IF(-'Summary & Ratios'!D$11=0,NA(),-'Summary & Ratios'!D$11)","v":92619.868678602536},{"$f":"IF(-'Summary & Ratios'!E$11=0,NA(),-'Summary & Ratios'!E$11)","v":92619.868678602506},{"$f":"IF(-'Summary & Ratios'!F$11=0,NA(),-'Summary & Ratios'!F$11)","v":92619.868678602506},{"$f":"IF(-'Summary & Ratios'!G$11=0,NA(),-'Summary & Ratios'!G$11)","v":92619.868678602477},{"$f":"IF(-'Summary & Ratios'!H$11=0,NA(),-'Summary & Ratios'!H$11)","v":92619.868678602477},{"$f":"IF(-'Summary & Ratios'!I$11=0,NA(),-'Summary & Ratios'!I$11)","v":92619.868678602477},{"$f":"IF(-'Summary & Ratios'!J$11=0,NA(),-'Summary & Ratios'!J$11)","v":92619.868678602477},{"$f":"IF(-'Summary & Ratios'!K$11=0,NA(),-'Summary & Ratios'!K$11)","v":92619.868678602477},{"$f":"IF(-'Summary & Ratios'!L$11=0,NA(),-'Summary & Ratios'!L$11)","v":92619.868678602492},{"$f":"IF(-'Summary & Ratios'!M$11=0,NA(),-'Summary & Ratios'!M$11)","v":92619.868678602477}]
[null,"Other Costs",{"$f":"'Sources & Uses'!C19","v":12200},null,"Sale Price",{"$f":"SUM('Return Detail'!F10:O10)","v":2734023.0499539273},null,"Net Sale Proceeds",{"$f":"SUM('Return Detail'!$F$33:$O$35)","v":1961947.1097447304},{"$f":"SUM('Return Detail'!F84:O84)","v":1813919.4932222739},null,"Leveraged IRR",{"$f":"'Return Detail'!C42","v":0.10295200706440744},null,"Cash Flow After Taxes",{"$f":"'Return Detail'!F$83","v":763.13902573153609},{"$f":"'Return Detail'!G$83","v":0},{"$f":"'Return Detail'!H$83","v":0},{"$f":"'Return Detail'!I$83","v":616.38305738327472},{"$f":"'Return Detail'!J$83","v":0},{"$f":"'Return Detail'!K$83","v":11874.390000764019},{"$f":"'Return Detail'!L$83","v":-2517.3998652723749},{"$f":"'Return Detail'!M$83","v":-28198.012927399483},{"$f":"'Return Detail'!N$83","v":-24650.573962150207},{"$f":"'Return Detail'!O$83","v":33088.458559253238}]
{"$rows_left_out":64}
{"sheet":"Summary & Ratios","index":8,"n_rows":58,"n_cols":14,"rows_kept":58,"cut":false,"hidden":false,"merged":[[57,1,57,12]]}
[]
[null,"Summary & Ratios"]
[]
[null,null,null,1,2,3,4,5,6,7,8,9,10," "]
[null,null,null,{"$f":"RPMDateSpan(D4,1)","v":"Jan 22 - Dec 22"},{"$f":"RPMDateSpan(E4,1)","v":"Jan 23 - Dec 23"},"Jan 24 - Dec 24","Jan 25 - Dec 25","Jan 26 - Dec 26","Jan 27 - Dec 27","Jan 28 - Dec 28","Jan 29 - Dec 29","Jan 30 - Dec 30","Jan 31 - Dec 31"]
[null,"Operating Summary"]
[null,"Effective Gross Income",null,{"$f":"'Cash Flows'!F35","v":197730.00000000003},{"$f":"'Cash Flows'!G35","v":197730.00000000003},{"$f":"'Cash Flows'!H35","v":170831.96903999997},{"$f":"'Cash Flows'!I35","v":205783.93583999999},{"$f":"'Cash Flows'!J35","v":188390.63328000007},{"$f":"'Cash Flows'!K35","v":230397.83351999999},{"$f":"'Cash Flows'!L35","v":235470.71123999998},{"$f":"'Cash Flows'!M35","v":221206.67087999999},{"$f":"'Cash Flows'!N35","v":255382.12224000003},{"$f":"'Cash Flows'!O35","v":263044.33343999996},{"$f":"SUM(D7:M7)","v":2165968.2094799997}]
[null,"Operating Expenses",null,{"$f":"-'Cash Flows'!F53","v":-69209.200000000012},{"$f":"-'Cash Flows'!G53","v":-71048.200000000012},{"$f":"-'Cash Flows'!H53","v":-71866.448761599997},{"$f":"-'Cash Flows'!I53","v":-75215.522533600015},{"$f":"-'Cash Flows'!J53","v":-76529.315384200003},{"$f":"-'Cash Flows'!K53","v":-80279.414095389991},{"$f":"-'Cash Flows'!L53","v":-82614.234226827699},{"$f":"-'Cash Flows'!M53","v":-84239.53478574453},{"$f":"-'Cash Flows'!N53","v":-87868.290878660875},{"$f":"-'Cash Flows'!O53","v":-90504.369506332703},{"$f":"SUM(D8:M8)","v":-789374.53017235582}]
[null,"Operating Reserves",null,{"$f":"-'Cash Flows'!F61","v":-10000},{"$f":"-'Cash Flows'!G61","v":-10000},{"$f":"-'Cash Flows'!H61","v":-10000},{"$f":"-'Cash Flows'!I61","v":-10000},{"$f":"-'Cash Flows'!J61","v":-10000},{"$f":"-'Cash Flows'!K61","v":-10000},{"$f":"-'Cash Flows'!L61","v":-10000},{"$f":"-'Cash Flows'!M61","v":-10000},{"$f":"-'Cash Flows'!N61","v":-10000},{"$f":"-'Cash Flows'!O61","v":-10000},-100000]
[null,"Net Operating Income",null,{"$f":"'Cash Flows'!F63","v":118520.80000000002},{"$f":"'Cash Flows'!G63","v":116681.80000000002},{"$f":"'Cash Flows'!H63","v":88965.52027839997},{"$f":"'Cash Flows'!I63","v":120568.41330639998},{"$f":"'Cash Flows'!J63","v":101861.31789580006},{"$f":"'Cash Flows'!K63","v":140118.41942460998},{"$f":"'Cash Flows'!L63","v":142856.47701317229},{"$f":"'Cash Flows'!M63","v":126967.13609425546},{"$f":"'Cash Flows'!N63","v":157513.83136133914},{"$f":"'Cash Flows'!O63","v":162539.96393366726},1276593.679307644]
{"$rows_left_out":49}
{"sheet":"Return Detail","index":9,"n_rows":105,"n_cols":15,"rows_kept":105,"cut":false,"hidden":false,"merged":[[1,1,1,14],[104,1,104,14]]}
[]
[null,"Project Return Details"]
[]
[null,"Unlevered Returns"]
[null,null,null,null,null,1,2,3,4,5,6,7,8,9,10]
[null,"Net Operating Income",null,null,null,{"$f":"IF($F$5<=Hold,'Cash Flows'!F$63,0)","v":118520.80000000002},{"$f":"IF(G5<=Hold,'Cash Flows'!G$63,0)","v":116681.80000000002},{"$f":"IF(H5<=Hold,'Cash Flows'!H$63,0)","v":88965.52027839997},{"$f":"IF(I5<=Hold,'Cash Flows'!I$63,0)","v":120568.41330639998},{"$f":"IF(J5<=Hold,'Cash Flows'!J$63,0)","v":101861.31789580006},{"$f":"IF(K5<=Hold,'Cash Flows'!K$63,0)","v":140118.41942460998},{"$f":"IF(L5<=Hold,'Cash Flows'!L$63,0)","v":142856.47701317229},{"$f":"IF(M5<=Hold,'Cash Flows'!M$63,0)","v":126967.13609425546},{"$f":"IF(N5<=Hold,'Cash Flows'!N$63,0)","v":157513.83136133914},{"$f":"IF(O5<=Hold,'Cash Flows'!O$63,0)","v":162539.96393366726}]
[null,"Less: Net Capital Expenses",null,null,null,{"$f":"IF(F$5<=Hold,'Cash Flows'!F105*-1,0)","v":0},{"$f":"IF(G$5<=Hold,'Cash Flows'!G105*-1,0)","v":0},{"$f":"IF(H$5<=Hold,'Cash Flows'!H105*-1,0)","v":-48956.666666666672},{"$f":"IF(I$5<=Hold,'Cash Flows'!I105*-1,0)","v":0},{"$f":"IF(J$5<=Hold,'Cash Flows'!J105*-1,0)","v":-55398.333333333336},{"$f":"IF(K$5<=Hold,'Cash Flows'!K105*-1,0)","v":0},{"$f":"IF(L$5<=Hold,'Cash Flows'!L105*-1,0)","v":-48956.666666666672},{"$f":"IF(M$5<=Hold,'Cash Flows'!M105*-1,0)","v":-39938.333333333336},{"$f":"IF(N$5<=Hold,'Cash Flows'!N105*-1,0)","v":-55398.333333333336},{"$f":"IF(O$5<=Hold,'Cash Flows'!O105*-1,0)","v":0}]
[null,"Non-Regular Income",null,null,null,{"$f":"IF(F$5>Hold,0,'Cash Flows'!F$112)","v":0},{"$f":"IF(G$5>Hold,0,'Cash Flows'!G$112)","v":0},{"$f":"IF(H$5>Hold,0,'Cash Flows'!H$112)","v":3654.3484002025361},{"$f":"IF(I$5>Hold,0,'Cash Flows'!I$112)","v":0},{"$f":"IF(J$5>Hold,0,'Cash Flows'!J$112)","v":0},{"$f":"IF(K$5>Hold,0,'Cash Flows'!K$112)","v":0},{"$f":"IF(L$5>Hold,0,'Cash Flows'!L$112)","v":0},{"$f":"IF(M$5>Hold,0,'Cash Flows'!M$112)","v":0},{"$f":"IF(N$5>Hold,0,'Cash Flows'!N$112)","v":0},{"$f":"IF(O$5>Hold,0,'Cash Flows'!O$112)","v":10000}]
[null,"Operating Cash Flow",null,null,null,{"$f":"SUM(F6:F8)","v":118520.80000000002},{"$f":"SUM(G6:G8)","v":116681.80000000002},43663.202011935835,120568.41330639998,46462.984562466729,140118.41942460998,93899.810346505619,87028.802760922117,102115.49802800579,172539.96393366726]
[null,"Reversion Cash Flow",null,null,null,{"$f":"IFERROR(IF(F$5=Hold,IF(Disposition=\"Cap Rate\",'Cash Flows'!G$55/Exit_Rate,FV(Exit_Rate,Hold,0,-Acquisition_Gross)),0),0)","v":0},{"$f":"IFERROR(IF(G$5=Hold,IF(Disposition=\"Cap Rate\",'Cash Flows'!H$55/Exit_Rate,FV(Exit_Rate,Hold,0,-Acquisition_Gross)),0),0)","v":0},{"$f":"IFERROR(IF(H$5=Hold,IF(Disposition=\"Cap Rate\",'Cash Flows'!I$55/Exit_Rate,FV(Exit_Rate,Hold,0,-Acquisition_Gross)),0),0)","v":0},{"$f":"IFERROR(IF(I$5=Hold,IF(Disposition=\"Cap Rate\",'Cash Flows'!J$55/Exit_Rate,FV(Exit_Rate,Hold,0,-Acquisition_Gross)),0),0)","v":0},{"$f":"IFERROR(IF(J$5=Hold,IF(Disposition=\"Cap Rate\",'Cash Flows'!K$55/Exit_Rate,FV(Exit_Rate,Hold,0,-Acquisition_Gross)),0),0)","v":0},{"$f":"IFERROR(IF(K$5=Hold,IF(Disposition=\"Cap Rate\",'Cash Flows'!L$55/Exit_Rate,FV(Exit_Rate,Hold,0,-Acquisition_Gross)),0),0)","v":0},{"$f":"IFERROR(IF(L$5=Hold,IF(Disposition=\"Cap Rate\",'Cash Flows'!M$55/Exit_Rate,FV(Exit_Rate,Hold,0,-Acquisition_Gross)),0),0)","v":0},{"$f":"IFERROR(IF(M$5=Hold,IF(Disposition=\"Cap Rate\",'Cash Flows'!N$55/Exit_Rate,FV(Exit_Rate,Hold,0,-Acquisition_Gross)),0),0)","v":0},{"$f":"IFERROR(IF(N$5=Hold,IF(Disposition=\"Cap Rate\",'Cash Flows'!O$55/Exit_Rate,FV(Exit_Rate,Hold,0,-Acquisition_Gross)),0),0)","v":0},{"$f":"IFERROR(IF(O$5=Hold,IF(Disposition=\"Cap Rate\",'Cash Flows'!P$55/Exit_Rate,FV(Exit_Rate,Hold,0,-Acquisition_Gross)),0),0)","v":2734023.0499539273}]
{"$rows_left_out":96}
{"sheet":"Loan Amortization","index":10,"n_rows":170,"n_cols":15,"rows_kept":170,"cut":false,"hidden":false,"merged":[[43,8,43,9],[44,8,44,9],[45,8,45,9],[2,1,2,9],[4,7,4,8],[4,3,4,4]]}
[]
[]
[null,"Loan Amortization Schedule"]
[]
[null,null,null,"Interest Only Loan",null,null,null,"Amortizing Loan"]
[null,null,null,"Loan Amount",{"$f":"IF(Loan_IO_Approval=\"no\",\"-\",Loan_Amount)","v":"-"},null,null,"Loan Amount",{"$f":"Loan_Amount_Amortizing","v":1220000}]
[null,null,null,"Term",{"$f":"IF(Loan_IO_Approval=\"no\",\"-\",Loan_IO_Term)","v":"-"},null,null,"Term",{"$f":"Loan_Amor_Term","v":120}]
[null,null,null,"Rate",{"$f":"IF(Loan_IO_Approval=\"no\",\"-\",Loan_IO_Rate)","v":"-"},null,null,"Amortization",{"$f":"Loan_Amortization","v":240}]
[null,null,null,"Funding Status",{"$f":"IF(Loan_IO_Approval=\"no\",\"-\",IF(Loan_IO_Status=0,\"Fund Up (Default)\",Loan_IO_Status))","v":"-"},null,null,"Start Rate",{"$f":"Loan_Amor_Rate","v":4.4999999999999998E-2}]
[null,null,null,null,null,null,null,"Rate Type",{"$f":"Loan_Amor_Type","v":"Fixed"}]
{"$rows_left_out":161}
{"sheet":"Sources & Uses","index":11,"n_rows":39,"n_cols":14,"rows_kept":39,"cut":false,"hidden":false,"merged":[[36,1,36,13],[37,1,37,13],[38,1,38,13]]}
[]
[null,"Sources & Uses"]
[]
[null,"Period",0,1,2,3,4,5,6,7,8,9,10,"Total"]
[null,null,null,{"$f":"RPMDateSpan(D4,1)","v":"Jan 22 - Dec 22"},{"$f":"RPMDateSpan(E4,1)","v":"Jan 23 - Dec 23"},"Jan 24 - Dec 24","Jan 25 - Dec 25","Jan 26 - Dec 26","Jan 27 - Dec 27","Jan 28 - Dec 28","Jan 29 - Dec 29","Jan 30 - Dec 30","Jan 31 - Dec 31"]
[]
[null,"Sources Of Capital"]
[null,"Debt Proceeds",{"$f":"IF(AND(Loan_IO_Status=\"Fund Up\",Loan_IO_Term>0,Loan_IO_Approval=\"Yes\"),0,Loan_Amount)","v":1220000},{"$f":"IF(AND(Loan_IO_Status<>\"Fund Up\",Loan_IO_Approval=\"No\"),0,IF(D4*12<=Loan_IO_MonthFunded,VLOOKUP(D4,Amortization_Schedule_Annual,9,FALSE)-SUM($C$8:C8),IF(AND(Loan_IO_MonthFunded>C4*12,Loan_IO_MonthFunded<=D4*12),Loan_Amount-SUM($C$8:C8),0)))","v":-38507.648169978755},{"$f":"IF(AND(Loan_IO_Status<>\"Fund Up\",Loan_IO_Approval=\"No\"),0,IF(E4*12<=Loan_IO_MonthFunded,VLOOKUP(E4,Amortization_Schedule_Annual,9,FALSE)-SUM($C$8:D8),IF(AND(Loan_IO_MonthFunded>D4*12,Loan_IO_MonthFunded<=E4*12),Loan_Amount-SUM($C$8:D8),0)))","v":0},{"$f":"IF(AND(Loan_IO_Status<>\"Fund Up\",Loan_IO_Approval=\"No\"),0,IF(F4*12<=Loan_IO_MonthFunded,VLOOKUP(F4,Amortization_Schedule_Annual,9,FALSE)-SUM($C$8:E8),IF(AND(Loan_IO_MonthFunded>E4*12,Loan_IO_MonthFunded<=F4*12),Loan_Amount-SUM($C$8:E8),0)))","v":0},{"$f":"IF(AND(Loan_IO_Status<>\"Fund Up\",Loan_IO_Approval=\"No\"),0,IF(G4*12<=Loan_IO_MonthFunded,VLOOKUP(G4,Amortization_Schedule_Annual,9,FALSE)-SUM($C$8:F8),IF(AND(Loan_IO_MonthFunded>F4*12,Loan_IO_MonthFunded<=G4*12),Loan_Amount-SUM($C$8:F8),0)))","v":0},{"$f":"IF(AND(Loan_IO_Status<>\"Fund Up\",Loan_IO_Approval=\"No\"),0,IF(H4*12<=Loan_IO_MonthFunded,VLOOKUP(H4,Amortization_Schedule_Annual,9,FALSE)-SUM($C$8:G8),IF(AND(Loan_IO_MonthFunded>G4*12,Loan_IO_MonthFunded<=H4*12),Loan_Amount-SUM($C$8:G8),0)))","v":0},{"$f":"IF(AND(Loan_IO_Status<>\"Fund Up\",Loan_IO_Approval=\"No\"),0,IF(I4*12<=Loan_IO_MonthFunded,VLOOKUP(I4,Amortization_Schedule_Annual,9,FALSE)-SUM($C$8:H8),IF(AND(Loan_IO_MonthFunded>H4*12,Loan_IO_MonthFunded<=I4*12),Loan_Amount-SUM($C$8:H8),0)))","v":0},{"$f":"IF(AND(Loan_IO_Status<>\"Fund Up\",Loan_IO_Approval=\"No\"),0,IF(J4*12<=Loan_IO_MonthFunded,VLOOKUP(J4,Amortization_Schedule_Annual,9,FALSE)-SUM($C$8:I8),IF(AND(Loan_IO_MonthFunded>I4*12,Loan_IO_MonthFunded<=J4*12),Loan_Amount-SUM($C$8:I8),0)))","v":0},{"$f":"IF(AND(Loan_IO_Status<>\"Fund Up\",Loan_IO_Approval=\"No\"),0,IF(K4*12<=Loan_IO_MonthFunded,VLOOKUP(K4,Amortization_Schedule_Annual,9,FALSE)-SUM($C$8:J8),IF(AND(Loan_IO_MonthFunded>J4*12,Loan_IO_MonthFunded<=K4*12),Loan_Amount-SUM($C$8:J8),0)))","v":0},{"$f":"IF(AND(Loan_IO_Status<>\"Fund Up\",Loan_IO_Approval=\"No\"),0,IF(L4*12<=Loan_IO_MonthFunded,VLOOKUP(L4,Amortization_Schedule_Annual,9,FALSE)-SUM($C$8:K8),IF(AND(Loan_IO_MonthFunded>K4*12,Loan_IO_MonthFunded<=L4*12),Loan_Amount-SUM($C$8:K8),0)))","v":0},{"$f":"IF(AND(Loan_IO_Status<>\"Fund Up\",Loan_IO_Approval=\"No\"),0,IF(M4*12<=Loan_IO_MonthFunded,VLOOKUP(M4,Amortization_Schedule_Annual,9,FALSE)-SUM($C$8:L8),IF(AND(Loan_IO_MonthFunded>L4*12,Loan_IO_MonthFunded<=M4*12),Loan_Amount-SUM($C$8:L8),0)))","v":0},{"$f":"SUM(C8:M8)","v":1181492.3518300212}]
[null,"Refinance Proceeds",0,{"$f":"IF(Hold<D4,0,IF(ROUNDUP((Loan_IO_Term+1)/12,0)=D4,Loan_Amount_Amortizing-Loan_Amount,0))","v":0},0,0,0,0,0,0,0,0,0,{"$f":"SUM(C9:M9)","v":0}]
[null,"Equity Contributions",{"$f":"Equity_Amount","v":792200},{"$f":"IF('Return Detail'!F85<0,-'Return Detail'!F85,0)","v":0},{"$f":"IF('Return Detail'!G85<0,-'Return Detail'!G85,0)","v":0},{"$f":"IF('Return Detail'!H85<0,-'Return Detail'!H85,0)","v":0},{"$f":"IF('Return Detail'!I85<0,-'Return Detail'!I85,0)","v":0},{"$f":"IF('Return Detail'!J85<0,-'Return Detail'!J85,0)","v":0},{"$f":"IF('Return Detail'!K85<0,-'Return Detail'!K85,0)","v":0},{"$f":"IF('Return Detail'!L85<0,-'Return Detail'!L85,0)","v":2517.3998652723749},{"$f":"IF('Return Detail'!M85<0,-'Return Detail'!M85,0)","v":28198.012927399483},{"$f":"IF('Return Detail'!N85<0,-'Return Detail'!N85,0)","v":24650.573962150207},{"$f":"IF('Return Detail'!O85<0,-'Return Detail'!O85,0)","v":0},{"$f":"SUM(C10:M10)","v":847565.98675482208}]
{"$rows_left_out":30}
{"sheet":"Equity Investor Returns","index":12,"n_rows":190,"n_cols":27,"rows_kept":190,"cut":false,"hidden":false,"merged":[[189,1,189,13],[1,1,1,13],[5,4,5,5],[58,1,58,13],[59,1,59,13],[60,1,60,13],[61,1,61,13],[65,1,65,13],[67,1,67,13],[186,1,186,13],[187,1,187,13],[188,1,188,13]]}
[]
[null,{"$f":"IF(LEFT(B21,3)=\"Pre\",\"Pre-Tax Equity Investor Returns\",\"Post-Tax Equity Investor Returns\")","v":"Pre-Tax Equity Investor Returns"}]
[null,null,null,null,null,null,null,null,null,null,null,null,null,null,null,null,"Year",1,2,3,4,5,6,7,8,9,10]
[null,null,null,null,null,null,null,null,null,null,null,null,null,null,null,null,"Equity Investor",{"$f":"E32","v":25900.931321397482},{"$f":"F32","v":24061.931321397511},-48956.666666666672,27948.544627797499,-46156.884116135749,47498.550746007502,1279.9416679031419,-5591.0659176803529,9495.6293494033089,1060893.65012743]
[null,null,null,null,null,null,null,null,null,null,null,null,null,null,null,null,"Developer",{"$f":"E47","v":0},{"$f":"F47","v":0},0,0,0,0,0,0,0,980973.5548723652]
[null,null,null,null,"Cash Flow Distribution"]
[null,null,"Method","Basis","Rate","Equity Investor Split","Developer Split"]
[null,"Initial Equity Contribution",null,null,null,{"$f":"Contribution_JV","v":0.9},{"$f":"Contribution_Developer","v":0.1}]
[null,"Preferred Return","Cumulative","Cash on Cash",{"$f":"Equity_Rate","v":0.1},1,{"$f":"1-Pref_Investor","v":0}]
[null,"Hurdle 1",null,{"$f":"D9","v":"Cash on Cash"},{"$f":"Preferred_Return_Rate+0.02","v":0.12000000000000001},{"$f":"F8","v":0.9},{"$f":"1-F10","v":9.9999999999999978E-2}]
{"$rows_left_out":181}
{"sheet":"Holding Period Sensitivity","index":13,"n_rows":87,"n_cols":15,"rows_kept":87,"cut":false,"hidden":false,"merged":[[84,5,84,14],[85,5,85,14],[86,5,86,14],[2,1,2,14],[3,1,3,14]]}
[]
[]
[null,"Holding Period Sensitivity Analysis"]
[null,"These charts show the project's pre-tax perfomanced based on Disposition year.  They assume continued financing regardless of term."]
[]
[]
[]
[]
[]
[]
{"$rows_left_out":77}